{"text_format":"3","workbook":"xlsx","n_sheets":12,"sheets":["Software Technical Assessment","Documentation","SOP 14","Instructions","Report Pages 1-3","Report Page 4","Data Entry","Control Data","Calculations","CIPM Air Density","Uncertainty Analysis","Tables & Lists"],"not_rendered":{"charts":1,"images":11,"external_links":4,"defined_names":180,"comments":1},"read":"whole","date_system":"1900"}

{"sheet":"Software Technical Assessment","index":0,"n_rows":49,"n_cols":4,"rows_kept":49,"merged":[[5,0,17,0],[18,0,21,0],[22,0,25,0],[26,0,28,0],[29,0,34,0],[35,0,38,0],[39,0,40,0],[43,0,48,0],[56,4,56,5]]}
["Software Technical Assessment"]
[]
["Software Description","WAMRF-005 (Rev. 32), Volume Gravimetric Calibration Workbook","Approval Date","2015-11-06"]
["Assessed By","Dan Wright","Approved By","Dan Wright"]
["Codes","Assessment","Pass/Fail","Evidence"]
["A. Software Inspection","Spreadsheet is clear and makes sense","Pass","All worksheet are appropriately named and easy to understand"]
[null,"There are instructions for use ","Pass","Instructions worksheet"]
[null,"Instructions and data input appear on the visible portion of the first worksheet","Pass","The workbook opens to the instruction worksheet"]
[null,"Data-entry fields are labeled and color coded (it is recommended to avoid red and green)","Pass","Light yellow for blank, light blue for non-blank cells"]
[null,"The Standard Operating Procedure (SOP) used is clearly specified","Pass","Specified on Uncertainty worksheet"]
{"$rows_left_out":40}
{"sheet":"Documentation","index":1,"n_rows":90,"n_cols":3,"rows_kept":90}
["Documentation"]
["Date","Description","Initials"]
["2001-06-14","This workbook was developed by Dan Wright, Washington State Department of Agriculture, Weights and Measures Program,  Metrology Laboratory. It follows the procedure documented in NISTIR 7383, SOP 14. NIST WMD has evaluated this spreadsheet and provided useful feedback in its development.","DAW"]
["2004-03-03","Updated water density formula to the Patterson/Morris equation provided by NIST, WMD.","DAW"]
["2004-05-12","Changed entire workbook to be more user friendly. Updated uncertainties.","DAW"]
["2004-09-07","Added new uncertainty analysis.","DAW"]
["2007-02-06","Corrected errors found during validation. Changed uncertainty analysis to the Kragten spreadsheet. Added tolerances for volumetric vessels.","DAW"]
["2007-03-30","Added unit column to temperature standards. Reformatted standards tables to make it easier to enter or delete standards.","DAW"]
["2007-09-24","Rounded air density formula to 6 places and water density formula to 8 places.","DAW"]
["2008-02-20","Removed 'Standards' worksheet. Linked customer and standards cells to the 'Customer' and 'Standards' workbooks. Reformatted 'Documentation' worksheet.","DAW"]
{"$rows_left_out":81}
{"sheet":"SOP 14","index":2,"n_rows":0,"n_cols":0,"rows_kept":0}

{"sheet":"Instructions","index":3,"n_rows":151,"n_cols":2,"rows_kept":151,"merged":[[0,0,0,1],[10,0,10,1]]}
["Instructions"]
["No.","Description"]
[1,"The uncertainty analysis used in this workbook is only one way of determining uncertainties for this measurement. Please review and insure this method meets your requirements and expectations. Modify as necessary."]
[2,"This workbook must be validated by the user before use and after any changes or modifications."]
[3,"The worksheets are password protected. Password is password. You should protect each sheet with your own unique password. Place a password hint here so you don't forget it. Password hint is: \"?\""]
[4,"Validate all ranges after any changes and during annual reviews."]
[5,"Open as a new workbook and save using the Report Number and customer name."]
[6,"Enter the appropriate data in the light yellow cells on the Data Entry worksheet."]
[7,"Modify both report worksheets for your laboratory and audit to insure the report meets requirements of ISO/IEC 17025. (hint: I convert the report worksheets to a .pdf file to keep as a permanent copy)."]
[8,"To view the SOP, unprotect the worksheet then double click on it. "]
{"$rows_left_out":142}
{"sheet":"Report Pages 1-3","index":4,"n_rows":94,"n_cols":7,"rows_kept":94,"merged":[[32,0,33,6],[37,5,37,6],[40,0,40,1],[40,2,40,6],[41,0,41,6],[57,3,57,4],[58,0,58,1],[58,3,58,4],[59,0,59,1],[59,3,59,4],[60,0,60,1],[60,3,60,4],[61,0,61,1],[61,3,61,4],[62,0,62,1],[62,3,62,4],[63,0,63,1],[63,3,63,4],[64,0,64,1],[64,3,64,4],[66,0,66,6],[68,0,68,6],[70,0,70,6],[71,0,71,6],[75,0,75,6],[76,0,76,6],[77,0,77,6],[78,0,78,6],[79,0,79,6],[80,0,80,6],[81,0,81,6],[86,0,86,2],[86,3,86,4],[86,5,86,6],[87,0,87,2],[87,3,87,4],[87,5,87,6],[89,0,89,2],[89,3,89,4],[89,5,89,6],[91,0,91,2],[91,3,91,4],[91,5,91,6],[92,0,92,2],[92,3,92,4],[92,5,92,6],[93,0,93,2],[93,3,93,4],[93,5,93,6]]}
{"$rows_empty":10}
[{"$nulls":3},"REPORT OF CALIBRATION"]
[]
[{"$nulls":3},"Issued To:"]
[{"$nulls":3},{"$f":"IF('Data Entry'!A4=\"\",\"\",'Data Entry'!A4)","v":""}]
[{"$nulls":3},{"$f":"IF('Data Entry'!A5=\"\",\"\",'Data Entry'!A5)","v":""}]
[{"$nulls":3},{"$f":"IF('Data Entry'!A6=\"\",\"\",'Data Entry'!A6)","v":""}]
[{"$nulls":3},{"$f":"IF('Data Entry'!A7=\"\",\"\",'Data Entry'!A7)","v":""}]
[]
[{"$nulls":3},"Point of Contact:"]
{"$rows_left_out":76}
{"sheet":"Report Page 4","index":5,"n_rows":5,"n_cols":6,"rows_kept":5,"merged":[[0,0,0,5]]}
["WSDA Weights and Measures Metrology Laboratory"]
[{"$f":"\"Report Number: \"&RptNo","v":"Report Number: "},{"$nulls":4},{"$f":"IF(Cal_Date=\"\",\"Calibration Date\",\"Calibration Date: \"&TEXT(Cal_Date,\"mmmm d, yyyy\"))","v":"Calibration Date"}]
["Calibration Results"]
[{"$f":"IF(NomVal=\"\",\"Nominal Volume\",\"Nominal Volume (\"&VLOOKUP(NomValueUnit,VolTable,5)&\")\")","v":"Nominal Volume"},{"$f":"IF(NomVal=\"\",\"As Found/Left\",\"As Found/Left \n\"&TypeCal&\"\n (\"&VLOOKUP(NomValueUnit,VolTable,5)&\")\")","v":"As Found/Left"},"Reference\nTemperature",{"$f":"IF(Spec=\"\",\"Specification Tolerance\",IF(Spec=\"Not Applicable\",\"Tolerance \"&Spec,Spec&\" Specification \nTolerance\n± (\"&VLOOKUP(NomValueUnit,VolTable,5)&\")\"))","v":"Specification Tolerance"},{"$f":"IF(NomVal=\"\",\"Uncertainty\n\",\"Uncertainty\nk=\"&Reportedk&\"\ndf=\"&Reported_df&\"\n± (\"&VLOOKUP(NomValueUnit,VolTable,5)&\")\")","v":"Uncertainty\n"},"Cubical Coefficient of Expansion"]
[{"$f":"IF(NomVal=\"\",\"\",NomVal)","v":""},{"$f":"IF(Calculations!C50=\"\",\"\",Calculations!C50)","v":""},{"$f":"IF(RefTemp=\"\",\"\",IF(RefTempUnit=\"Reference Temperature (ºC)\",RefTemp&\" ºC\",RefTemp&\" ºF\"))","v":""},{"$f":"IF(OR(Spec=\"Not Applicable\",NomVal=\"\"),\"\",VLOOKUP(NomValueUnit,VolTable,4,FALSE))","v":""},{"$f":"IF(Calculations!C53=\"\",\"\",Calculations!C53)","v":""},{"$f":"IF(Material=\"\",\"\",IF(RefTempUnit=\"Reference Temperature (ºF)\",FIXED(a/1.8,7)&\" / ºF\",a&\" / ºC\"))","v":""}]

{"sheet":"Data Entry","index":6,"n_rows":122,"n_cols":11,"rows_kept":122,"merged":[[0,8,0,10],[3,0,3,6],[3,7,3,9],[4,0,4,6],[4,8,4,10],[5,0,5,6],[5,8,5,10],[6,0,6,6],[6,8,6,10],[9,0,9,1],[9,2,9,5],[9,6,9,8],[9,9,9,10],[10,0,10,1],[10,2,10,5],[10,6,10,8],[10,9,10,10],[11,0,11,1],[11,2,11,5],[11,6,11,8],[11,9,11,10],[12,0,12,2],[12,3,12,5],[12,6,12,8],[12,9,12,10],[13,0,13,2],[13,3,13,6],[13,7,13,8],[13,9,13,10],[14,0,14,1],[14,3,14,5],[14,7,14,9],[15,0,15,2],[15,3,15,7],[15,9,15,10],[16,0,16,8],[16,9,16,10],[17,0,17,4],[17,6,17,9],[20,0,20,2],[20,3,20,4],[20,6,20,8],[21,0,21,1],[21,4,21,7],[21,8,21,9],[22,0,22,4],[22,5,22,7],[22,8,22,9],[23,0,23,4],[23,5,23,6],[24,0,24,8],[24,9,24,10],[27,1,27,4],[27,5,27,6],[27,7,27,8],[28,1,28,4],[28,5,28,6],[28,7,28,8],[29,1,29,4],[29,5,29,6],[29,7,29,8],[30,1,30,4],[30,5,30,6],[30,7,30,8],[31,1,31,4],[31,5,31,6],[31,7,31,8],[32,1,32,4],[32,5,32,6],[32,7,32,8],[33,1,33,4],[33,5,33,6],[33,7,33,8],[36,3,36,4],[36,5,36,6],[37,0,40,0],[37,3,37,4],[37,5,37,6],[38,3,38,4],[38,5,38,6],[39,3,39,4],[39,5,39,6],[40,3,40,4],[40,5,40,6],[41,0,44,0],[41,3,41,4],[41,5,41,6],[42,3,42,4],[42,5,42,6],[43,3,43,4],[43,5,43,6],[44,3,44,4],[44,5,44,6],[47,3,47,4],[47,5,47,6],[47,7,47,8],[47,9,47,10],[48,3,48,4],[48,5,48,6],[48,7,48,8],[48,9,48,10],[49,3,49,4],[49,5,49,6],[49,7,49,8],[49,9,49,10],[50,3,50,4],[50,5,50,6],[50,7,50,8],[50,9,50,10],[51,3,51,4],[51,5,51,6],[51,7,51,8],[51,9,51,10],[54,0,54,10],[55,0,55,2],[55,3,55,4],[55,5,55,10],[56,0,56,10],[59,0,59,7],[59,8,59,10],[60,0,63,3],[60,4,60,7],[60,8,60,10],[61,4,61,7],[61,8,61,10],[62,4,62,7],[62,8,62,10],[63,4,63,7],[63,8,63,10],[64,1,64,7],[64,8,64,10],[65,1,65,7],[65,8,65,10],[66,0,66,7],[66,8,66,10],[67,1,67,7],[67,8,67,10],[68,0,68,7],[68,8,68,10],[69,0,69,10],[70,0,73,3],[70,4,70,7],[70,8,70,10],[71,4,71,7],[71,8,71,10],[72,4,72,7],[72,8,72,10],[73,4,73,7],[73,8,73,10],[74,0,74,7],[74,8,74,10],[75,0,78,3],[75,4,75,7],[75,8,75,10],[76,4,76,7],[76,8,76,10],[77,4,77,7],[77,8,77,10],[78,4,78,7],[78,8,78,10],[79,1,79,7],[79,8,79,10],[80,1,80,7],[80,8,80,10],[81,0,81,7],[81,8,81,10],[82,1,82,7],[82,8,82,10],[83,0,83,7],[83,8,83,10],[84,0,84,10],[85,0,88,3],[85,4,85,7],[85,8,85,10],[86,4,86,7],[86,8,86,10],[87,4,87,7],[87,8,87,10],[88,4,88,7],[88,8,88,10],[89,0,89,10],[90,0,90,7],[90,8,90,10],[91,0,94,3],[91,4,91,7],[91,8,91,10],[92,4,92,7],[92,8,92,10],[93,4,93,7],[93,8,93,10],[94,4,94,7],[94,8,94,10],[95,1,95,7],[95,8,95,10],[96,1,96,7],[96,8,96,10],[97,1,97,7],[97,8,97,10],[98,0,98,7],[98,8,98,10],[99,1,99,7],[99,8,99,10],[100,0,100,7],[100,8,100,10],[101,0,101,10],[102,0,105,3],[102,4,102,7],[102,8,102,10],[103,4,103,7],[103,8,103,10],[104,4,104,7],[104,8,104,10],[105,4,105,7],[105,8,105,10],[106,0,106,7],[106,8,106,10],[107,0,110,3],[107,4,107,7],[107,8,107,10],[108,4,108,7],[108,8,108,10],[109,4,109,7],[109,8,109,10],[110,4,110,7],[110,8,110,10],[111,1,111,7],[111,8,111,10],[112,1,112,7],[112,8,112,10],[113,1,113,7],[113,8,113,10],[114,0,114,7],[114,8,114,10],[115,1,115,7],[115,8,115,10],[116,0,116,7],[116,8,116,10],[117,0,117,10],[118,0,121,3],[118,4,118,7],[118,8,118,10],[119,4,119,7],[119,8,119,10],[120,4,120,7],[120,8,120,10],[121,4,121,7],[121,8,121,10]]}
["Data Entry",{"$nulls":6},"Report Number:"]
[]
["Customer Information"]
[{"$nulls":7},"Customer ID"]
[{"$nulls":7},"PO#"]
[{"$nulls":7},"POC"]
[{"$nulls":7},"Phone"]
[]
["Artifact Information"]
["Description",{"$nulls":5},"Date Received"]
{"$rows_left_out":107}
{"sheet":"Control Data","index":7,"n_rows":6,"n_cols":11,"rows_kept":6}
["Control Chart Information",{"$nulls":9},{"$f":"IF(RptNo=\"\",\"\",\"Report Number: \"&RptNo)","v":""}]
["Note: Copy and Paste Appropriate Row(s) to Control Chart"]
[]
["R-Chart Information"]
["Tech. Initials","Date","Test Number",{"$f":"IF(RefTempUnit=\"Reference Temerature (ºF)\",\"Volume (Trial 1) @ \"&RefTemp&\" ºF (mL)\",\"Volume (Trial 1) @ \"&RefTemp&\" ºC (mL)\")","v":"Volume (Trial 1) @  ºC (mL)"},{"$f":"IF(RefTempUnit=\"Reference Temerature (ºF)\",\"Volume (Trial 2) @ \"&RefTemp&\" ºF (mL)\",\"Volume (Trial 2) @ \"&RefTemp&\" ºC (mL)\")","v":"Volume (Trial 2) @  ºC (mL)"},"Start Humidity (% RH)","Finish Humidity (% RH)","Start Air Temp. (ºC)","Finish Air Temp. (ºC)","Water Temp. (Trial 1) (ºC)","Water Temp. (Trial 2) (ºC)"]
[{"$f":"IF(Tech_Int=\"\",\"\",Tech_Int)","v":""},{"$f":"IF(Cal_Date=\"\",\"\",Cal_Date)","v":""},{"$f":"IF(RptNo=\"\",\"\",RptNo)","v":""},{"$f":"Calculations!C29","v":""},{"$f":"Calculations!C30","v":""},{"$f":"'CIPM Air Density'!D6","v":""},{"$f":"'CIPM Air Density'!D12","v":""},{"$f":"'CIPM Air Density'!D5","v":""},{"$f":"'CIPM Air Density'!D11","v":""},{"$f":"IF(ISERROR(tw_1),\"\",tw_1)","v":""},{"$f":"IF(ISERROR(tw_2),\"\",tw_2)","v":""}]

{"sheet":"Calculations","index":8,"n_rows":53,"n_cols":8,"rows_kept":53,"merged":[[3,0,3,7],[4,2,4,3],[4,5,5,7],[5,2,5,3],[8,0,8,7],[9,2,9,3],[9,5,12,7],[10,2,10,3],[11,2,11,3],[12,2,12,3],[15,2,15,3],[16,2,16,3],[19,0,19,3],[19,4,19,7],[20,1,20,2],[20,5,20,6],[21,1,21,2],[21,5,21,6],[22,1,22,2],[22,5,22,6],[23,1,23,2],[23,5,23,6],[26,2,26,3],[26,5,27,7],[27,2,27,3],[28,2,28,3],[28,5,29,7],[29,2,29,3],[30,2,30,3],[33,0,33,7],[34,2,34,3],[34,5,35,7],[35,2,35,3],[38,0,38,7],[39,2,39,3],[39,5,40,7],[40,2,40,3],[43,0,43,7],[44,2,44,3],[44,5,46,7],[45,2,45,3],[46,2,46,3],[56,2,56,3]]}
["Calculations",{"$nulls":6},{"$f":"IF(RptNo=\"\",\"\",\"Report Number: \"&RptNo)","v":""}]
[]
["Air Density Determinations"]
["Air density results are rounded to 9 digits (g/cm³) according to SOP 14 "]
[null,"Run 1 ρa =",{"$f":"IF(ISERROR(CIPM_Pa1/1000),\"\",CIPM_Pa1/1000)","v":""},null,"g/cm3","Air Density, SOP 2, Option B, 2012 (CIPM 2007)"]
[null,"Run 2 ρa =",{"$f":"IF(ISERROR(CIPM_Pa2/1000),\"\",CIPM_Pa2/1000)","v":""},null,"g/cm3"]
[]
["Water Density Determinations"]
["Water density results are rounded to 8 digits (g/cm³) according to SOP 14 "]
[null,"Water temperature Trial 1 =",{"$f":"IF(option=\"\",\"\",IF(option=\"option a\",AVERAGE(A_tw1before+t_water_corr,A_tw1after+t_water_corr),AVERAGE(B_tw1before+t_water_corr,B_tw1after+t_water_corr)))","v":""},null,"º C","M. Tanaka, G. Girard, R. Davis, A. Peuto, and N. Bignell equation, Metrologia, 38, 301-309 (2001) Water Density Formula for Air Saturated Water"]
{"$rows_left_out":44}
{"sheet":"CIPM Air Density","index":9,"n_rows":13,"n_cols":5,"rows_kept":13,"merged":[[1,0,1,4],[2,0,2,4],[3,0,3,2],[3,3,3,4],[4,0,4,2],[4,3,4,4],[5,0,5,2],[5,3,5,4],[6,0,6,2],[6,3,6,4],[8,0,8,4],[9,0,9,2],[9,3,9,4],[10,0,10,2],[10,3,10,4],[11,0,11,2],[11,3,11,4],[12,0,12,2],[12,3,12,4]]}
["CIPM Air Density",{"$nulls":3},{"$f":"IF(RptNo=\"\",\"\",\"Report Number: \"&RptNo)","v":""}]
["Air Density, SOP 2, Option B, 2012 (CIPM 2007)"]
["Air Density Calculation Run 1"]
[" Barometric Pressure (mm Hg)",null,null,{"$f":"IF(option=\"\",\"\",IF(option=\"option a\",AVERAGE(P_1_Astart+P_corr,P_1_Aend+P_corr),AVERAGE(P_1_Bstart+P_corr,P_1_Bend+P_corr)))","v":""}]
[" Temperature (ºC)",null,null,{"$f":"IF(option=\"\",\"\",IF(option=\"option a\",AVERAGE(t_air1_Astart+t_air_corr,t_air1_Aend+t_air_corr),AVERAGE(t_air1_Bstart+t_air_corr,t_air1_Bend+t_air_corr)))","v":""}]
[" Relative Humidity (%)",null,null,{"$f":"IF(option=\"\",\"\",IF(option=\"option a\",AVERAGE(U_1_Astart+rh_corr,U_1_Aend+rh_corr),AVERAGE(U_1_Bstart+rh_corr,U_1_Bend+rh_corr)))","v":""}]
[" Calculated Air Density (mg/cm3)",null,null,{"$f":"IF(D6=\"\",\"\",((((D4*(133.322368421053))*(0.02896546))/((1-(((D4*133.322368421053)/(D5+273.15))*((0.00000158123)+((-0.000000029331)*(D5))+(0.00000000011043*D5^2)+(((0.000005707)+(-0.00000002051*D5))*((D6/100)*((1.00062+0.0000000314*(D4*133.322368421053)+0.00000056*D5^2)*((EXP(0.000012378847*(D5+273.15)^2+(-0.019121316*(D5+273.15))+33.93711047+(-6343.1645/(D5+273.15))))/(D4*133.322368421053)))))+((0.00019898+(-0.000002376*D5))*(((D6/100)*((1.00062+0.0000000314*(D4*133.322368421053)+0.00000056*D5^2)*((EXP(0.000012378847*(D5+273.15)^2+(-0.019121316)*(D5+273.15)+33.93711047+(-6343.1645)/(D5+273.15)))/(D4*133.322368421053))))^2))))+(((D4*133.322368421053)^2/((D5+273.15)^2)*(0.0000000000183+(-0.00000000765*(((D6/100)*((1.00062+0.0000000314*(D4*133.322368421053)+0.00000056*D5^2)*((EXP(0.000012378847*(D5+273.15)^2+(-0.019121316)*(D5+273.15)+33.93711047+(-6343.1645)/(D5+273.15)))/(D4*133.322368421053))))^2))))))*(8.314472)*(D5+273.15)))*(1-((0.378*((D6/100)*((1.00062+0.0000000314*(D4*133.322368421053)+0.00000056*D5^2)*((EXP(0.000012378847*(D5+273.15)^2+(-0.019121316)*(D5+273.15)+33.93711047+(-6343.1645)/(D5+273.15)))/(D4*133.322368421053)))))))))","v":""}]
[]
["Air Density Calculation Run 2"]
[" Barometric Pressure (mm Hg)",null,null,{"$f":"IF(option=\"\",\"\",IF(option=\"option a\",AVERAGE(P_2_Astart+P_corr,P_2_Aend+P_corr),AVERAGE(P_2_Bstart+P_corr,P_2_Bend+P_corr)))","v":""}]
{"$rows_left_out":4}
{"sheet":"Uncertainty Analysis","index":10,"n_rows":101,"n_cols":12,"rows_kept":101,"merged":[[0,2,0,5],[10,1,10,11],[21,1,21,11],[47,1,47,5],[47,6,47,11],[48,1,48,5],[48,6,48,11],[49,1,49,5],[49,6,49,11],[50,1,50,5],[50,6,50,11],[51,1,51,5],[51,6,51,11],[52,1,52,5],[52,6,52,11],[53,1,53,5],[53,6,53,11],[54,1,54,5],[54,6,54,11],[55,1,55,5],[55,6,55,11],[56,1,56,5],[56,6,56,11],[57,1,57,5],[57,6,57,11],[58,1,58,5],[58,6,58,11],[61,0,61,2],[61,3,61,5],[62,0,62,2],[62,3,62,5],[63,0,63,2],[63,3,63,5],[64,0,64,2],[64,3,64,5],[65,0,65,2],[65,3,65,5],[66,0,66,2],[66,3,66,5],[66,6,66,7],[67,0,67,2],[67,3,67,5],[67,6,67,7],[68,0,68,2],[68,3,68,5],[68,6,68,7],[69,0,69,2],[69,3,69,5],[69,6,69,7],[70,0,70,2],[70,3,70,5],[70,6,70,7],[71,0,71,2],[72,0,72,2],[72,5,72,6],[72,8,72,9],[72,10,72,11],[73,0,73,2],[73,5,73,6],[73,8,73,9],[73,10,73,11],[74,0,74,2],[74,5,74,6],[74,8,74,9],[74,10,74,11],[77,0,77,1],[78,0,78,1],[79,0,79,1],[80,0,80,1],[81,0,81,1],[82,0,82,1],[83,0,83,1],[84,0,84,1],[85,0,85,1],[86,0,86,1],[87,0,87,1],[88,0,88,1],[89,0,89,1],[90,0,90,1]]}
["Uncertainty Analysis",{"$nulls":10},{"$f":"IF(RptNo=\"\",\"\",\"Report Number: \"&RptNo)","v":""}]
[]
["Specify Procedure"]
["NISTIR 7383, SOP 14 Option A, Gravimetric Calibration of Volumetric Ware Using an Electronic Balance"]
[]
["Specify Equation(s)"]
["Measurement Option A - One Point Balance Calibration"]
[]
[]
["where"]
{"$rows_left_out":92}
{"sheet":"Tables & Lists","index":11,"n_rows":21,"n_cols":13,"rows_kept":21,"merged":[[2,2,2,7],[2,11,2,12],[12,2,13,2],[12,3,13,3],[12,4,13,4],[12,5,13,5],[12,6,13,6],[12,7,13,7],[17,0,17,6],[18,0,18,6],[19,0,19,6],[20,0,20,6]]}
["Tables & Lists",{"$nulls":6},{"$f":"IF(RptNo=\"\",\"\",\"Report Number: \"&RptNo)","v":""},null,"Tables & Lists",null,null,{"$f":"IF(RptNo=\"\",\"\",\"Report Number: \"&RptNo)","v":""}]
[]
[" Pick Lists\nfor\nData Validation Cells",null,"Volume Conversion Table\n(VolTable) &\nNominal Value Unit\n(Nom_Val_List)",{"$nulls":6},"Specification List",null,"Cubical Coefficient of Expansion Table\n(CCE_Table)\n&\nMaterial List\n(Materal_List)"]
["Graduated Cylinder",null,"NomValueUnit","Vref",{"$f":"\"U (k=\"&Reportedk&\")\"","v":"U (k=)"},"Tolerance","Symbol","Nominal Value (mL)",null,"Specification",null,"Material","cm³/ºC"]
["Volumetric Flask",null,"Nominal Value (cubic inch)",{"$f":"FIXED(Calculations!$C$31/16.38706,2-1-INT(LOG10(ABS(ReportedUnc/16.38706))),TRUE)","v":{"$error":"#VALUE!"}},{"$f":"FIXED(ReportedUnc/16.38706,2-1-INT(LOG10(ABS(ReportedUnc/16.38706))),TRUE)","v":{"$error":"#VALUE!"}},{"$f":"FIXED(Tol/16.38706,2-1-INT(LOG10(ABS(ReportedUnc/16.38706))),TRUE)","v":{"$error":"#VALUE!"}},"in³",{"$f":"NomVal*16.38706","v":0},null,"ASTM E 1272, Class A",null,"Glass, Borosilicate (TICA)",1e-05]
["Volumetric Container",null,"Nominal Value (fluid ounce)",{"$f":"FIXED(Calculations!$C$31/29.57353,2-1-INT(LOG10(ABS(ReportedUnc/29.57353))),TRUE)","v":{"$error":"#VALUE!"}},{"$f":"FIXED(ReportedUnc/29.57353,2-1-INT(LOG10(ABS(ReportedUnc/29.57353))),TRUE)","v":{"$error":"#VALUE!"}},{"$f":"FIXED(Tol/29.57353,2-1-INT(LOG10(ABS(ReportedUnc/29.57353))),TRUE)","v":{"$error":"#VALUE!"}},"fl oz",{"$f":"NomVal*29.57353","v":0},null,"ASTM E 1272, Class B",null,"Glass, Borosilicate (TICB)",1.5E-5]
["Slicker Plate Standard",null,"Nominal Value (gallon)",{"$f":"FIXED(Calculations!$C$31/3785.412,2-1-INT(LOG10(ABS(ReportedUnc/3785.412))),TRUE)","v":{"$error":"#VALUE!"}},{"$f":"FIXED(ReportedUnc/3785.412,2-1-INT(LOG10(ABS(ReportedUnc/3785.412))),TRUE)","v":{"$error":"#VALUE!"}},{"$f":"FIXED(Tol/3785.412,2-1-INT(LOG10(ABS(ReportedUnc/3785.412))),TRUE)","v":{"$error":"#VALUE!"}},"gal",{"$f":"NomVal*3785.412","v":0},null,"ASTM E 288, Class A",null,"Glass, Soda-Lime",2.5e-05]
["Prover",null,"Nominal Value (gill)",{"$f":"FIXED(Calculations!$C$31/118.2941,2-1-INT(LOG10(ABS(ReportedUnc/118.2941))),TRUE)","v":{"$error":"#VALUE!"}},{"$f":"FIXED(ReportedUnc/118.2941,2-1-INT(LOG10(ABS(ReportedUnc/118.2941))),TRUE)","v":{"$error":"#VALUE!"}},{"$f":"FIXED(Tol/118.2941,2-1-INT(LOG10(ABS(ReportedUnc/118.2941))),TRUE)","v":{"$error":"#VALUE!"}},"gi",{"$f":"NomVal*118.2941","v":0},null,"ASTM E 288, Class A \"Wide Mouth\"",null,"Plastic, Polycarbonate",0.00045]
["Test Measure",null,"Nominal Value (liquid pint)",{"$f":"FIXED(Calculations!$C$31/473.1765,2-1-INT(LOG10(ABS(ReportedUnc/473.1765))),TRUE)","v":{"$error":"#VALUE!"}},{"$f":"FIXED(ReportedUnc/473.1765,2-1-INT(LOG10(ABS(ReportedUnc/473.1765))),TRUE)","v":{"$error":"#VALUE!"}},{"$f":"FIXED(Tol/473.1765,2-1-INT(LOG10(ABS(ReportedUnc/473.1765))),TRUE)","v":{"$error":"#VALUE!"}},"liq pt",{"$f":"NomVal*473.1765","v":0},null,"ASTM E 288, Class B",null,"Plastic, Polypropylene",0.00024]
[null,null,"Nominal Value (liquid quart)",{"$f":"FIXED(Calculations!$C$31/946.3529,2-1-INT(LOG10(ABS(ReportedUnc/946.3529))),TRUE)","v":{"$error":"#VALUE!"}},{"$f":"FIXED(ReportedUnc/946.3529,2-1-INT(LOG10(ABS(ReportedUnc/946.3529))),TRUE)","v":{"$error":"#VALUE!"}},{"$f":"FIXED(Tol/946.3529,2-1-INT(LOG10(ABS(ReportedUnc/946.3529))),TRUE)","v":{"$error":"#VALUE!"}},"liq qt",{"$f":"NomVal*946.3529","v":0},null,"ASTM E 288, Class B \"Wide Mouth\"",null,"Plastic, Polystyrene",0.00021]
{"$rows_left_out":11}