{"text_format":"3","workbook":"xlsx","n_sheets":11,"sheets":["Software Technical Assessment","Documentation","SOP 19","Instructions","Report Pages 1-3","Report Page 4","Prover Data Entry","Control Data","Calculations","Uncertainty Analysis","Tables & Lists"],"not_rendered":{"charts":1,"images":8,"external_links":4,"defined_names":136,"comments":2},"read":"whole","date_system":"1900"}

{"sheet":"Software Technical Assessment","index":0,"n_rows":49,"n_cols":4,"rows_kept":49,"merged":[[5,0,17,0],[18,0,21,0],[22,0,25,0],[26,0,28,0],[29,0,34,0],[35,0,38,0],[39,0,40,0],[43,0,48,0],[56,4,56,5]]}
["Software Technical Assessment"]
[]
["Software Description","WAMRF-013 (Rev. 31), SOP 19 Workbook","Approval Date","2015-11-06"]
["Assessed By","Dan Wright","Approved By","Dan Wright"]
["Codes","Assessment","Pass/Fail","Evidence"]
["A. Software Inspection","Spreadsheet is clear and makes sense","Pass","All worksheet are appropriately named and easy to understand"]
[null,"There are instructions for use ","Pass","Instructions worksheet"]
[null,"Instructions and data input appear on the visible portion of the first worksheet","Pass","The workbook opens to the instructions worksheet"]
{"$rows_left_out":42}
{"sheet":"Documentation","index":1,"n_rows":79,"n_cols":3,"rows_kept":79}
["Documentation",null,{"$f":"IF(ISBLANK(RptNo),\"\",\"Report Number: \"&RptNo)","v":""}]
["Date","Description","Initials"]
["2004-01-30","This workbook was developed by Dan Wright, Washington State Department of Agriculture Metrology Laboratory. It follows the procedure documented in NISTIR 7383, SOP 19. NIST/WMD has evaluated this spreadsheet and provided useful feedback in its development.","DAW"]
["2004-03-03","Updated water density formula to the Patterson/Morris equation.","DAW"]
["2004-03-05","Updated water density formula to the Patterson/Morris equation on the 'Uncertainty Analysis' worksheet.","DAW"]
["2004-03-11","Made suggested changed from NIST, WMD.","DAW"]
["2004-07-06","Updated uncertainty analysis to new format.","DAW"]
["2004-09-10","Updated uncertainty analysis.","DAW"]
{"$rows_left_out":72}
{"sheet":"SOP 19","index":2,"n_rows":0,"n_cols":0,"rows_kept":0}

{"sheet":"Instructions","index":3,"n_rows":105,"n_cols":2,"rows_kept":105,"merged":[[0,0,0,1],[7,0,7,1]]}
["Instructions"]
["No.","Description"]
[1,"This workbook must be validated after any changes or modifications."]
[2,"The worksheets are password protected. Password is password. You should protect each sheet with your own unique password. Place a password hint here so you don't forget it. Password hint is: \"?\""]
[3,"Validate all links and ranges after any changes and during annual reviews."]
[4,"Modify the report pages with your laboratory and accreditation authority information."]
[5,"Modify the footer information on the report sheets and the header information on all other sheets if you want to use your own form number for the template."]
["Range Names"]
{"$rows_left_out":98}
{"sheet":"Report Pages 1-3","index":4,"n_rows":92,"n_cols":7,"rows_kept":92,"merged":[[32,0,33,6],[37,5,37,6],[40,0,40,1],[40,2,40,6],[41,0,41,6],[56,3,56,4],[57,0,57,1],[57,3,57,4],[58,0,58,1],[58,3,58,4],[59,0,59,1],[59,3,59,4],[60,0,60,1],[60,3,60,4],[61,0,61,1],[61,3,61,4],[62,0,62,1],[62,3,62,4],[63,0,63,1],[63,3,63,4],[64,0,64,1],[64,3,64,4],[67,0,67,6],[70,0,70,6],[73,0,73,6],[74,0,74,6],[78,0,78,6],[79,0,79,6],[80,0,80,6],[81,0,81,6],[82,0,82,6],[83,0,83,6],[88,0,88,2],[88,3,88,4],[88,5,88,6],[89,0,89,2],[89,3,89,4],[89,5,89,6],[90,0,90,2],[90,3,90,4],[90,5,90,6],[91,0,91,2],[91,3,91,4],[91,5,91,6]]}
{"$rows_empty":10}
[{"$nulls":3},"REPORT OF CALIBRATION"]
[]
[{"$nulls":3},"Issued To:"]
[{"$nulls":3},{"$f":"IF('Prover Data Entry'!A4=\"\",\"\",'Prover Data Entry'!A4)","v":""}]
[{"$nulls":3},{"$f":"IF('Prover Data Entry'!A5=\"\",\"\",'Prover Data Entry'!A5)","v":""}]
[{"$nulls":3},{"$f":"IF('Prover Data Entry'!A6=\"\",\"\",'Prover Data Entry'!A6)","v":""}]
[{"$nulls":3},{"$f":"IF('Prover Data Entry'!A7=\"\",\"\",'Prover Data Entry'!A7)","v":""}]
{"$rows_left_out":76}
{"sheet":"Report Page 4","index":5,"n_rows":38,"n_cols":8,"rows_kept":38,"merged":[[0,0,0,7],[7,0,7,2],[7,3,37,7]]}
["WSDA Weights and Measures Metrology Laboratory"]
[{"$f":"\"Report Number: \"&RptNo","v":"Report Number: "},{"$nulls":6},{"$f":"IF(Cal_Date=\"\",\"Calibration Date\",\"Calibration Date: \"&TEXT(Cal_Date,\"mmmm d, yyyy\"))","v":"Calibration Date"}]
["Table 1 - Calibration Results"]
["Nominal Volume",{"$f":"Description&\" Volume\nAs Found \"&IF(AND(RefTempUnit=\"Designated Reference Temperature For This Calibration (ºC)\",NomValUnit=\"Nominal Volume (L)\"),\"@ \"&RefT&\" ºC\n (L)\",IF(AND(RefTempUnit=\"Designated Reference Temperature For This Calibration (ºF)\",NomValUnit=\"Nominal Volume (L)\"),\"@ \"&RefT&\" ºF\n (L)\",IF(AND(RefTempUnit=\"Designated Reference Temperature For This Calibration (ºC)\",NomValUnit=\"Nominal Volume (gal)\"),\"@ \"&RefT&\" ºC\n (gal)\",IF(AND(RefTempUnit=\"Designated Reference Temperature For This Calibration (ºF)\",NomValUnit=\"Nominal Volume (gal)\"),\"@ \"&RefT&\" ºF\n (gal)\"))))","v":" Volume\nAs Found FALSE"},{"$f":"Description&\" Volume\nAs Left \"&IF(AND(RefTempUnit=\"Designated Reference Temperature For This Calibration (ºC)\",NomValUnit=\"Nominal Volume (L)\"),\"@ \"&RefT&\" ºC\n (L)\",IF(AND(RefTempUnit=\"Designated Reference Temperature For This Calibration (ºF)\",NomValUnit=\"Nominal Volume (L)\"),\"@ \"&RefT&\" ºF\n (L)\",IF(AND(RefTempUnit=\"Designated Reference Temperature For This Calibration (ºC)\",NomValUnit=\"Nominal Volume (gal)\"),\"@ \"&RefT&\" ºC\n (gal)\",IF(AND(RefTempUnit=\"Designated Reference Temperature For This Calibration (ºF)\",NomValUnit=\"Nominal Volume (gal)\"),\"@ \"&RefT&\" ºF\n (gal)\"))))","v":" Volume\nAs Left FALSE"},{"$f":"IF(NomValUnit=\"Nominal Volume (L)\",\"Specification\nTolerance\n\"&CHAR(177)&\" (L)\",\"Specification\nTolerance\n\"&CHAR(177)&\" (gal)\")","v":"Specification\nTolerance\n± (gal)"},{"$f":"IF(NomValUnit=\"Nominal Volume (L)\",\"Uncertainty\n\"&CHAR(177)&\" (L)\",\"Uncertainty\n\"&CHAR(177)&\" (gal)\")","v":"Uncertainty\n± (gal)"},"k factor","Degrees of Freedom","Calibration Seal Number"]
[{"$f":"IF(Nom_Val=\"\",\"\",IF(NomValUnit=\"Nominal Volume (L)\",Nom_Val&\" L\",Nom_Val&\" gal\"))","v":""},{"$f":"IF(AsFound=\"\",\"\",AsFound)","v":""},{"$f":"IF(AsLeft=\"\",\"\",AsLeft)","v":""},{"$f":"IF(Tolerance=\"\",\"\",Tolerance)","v":""},{"$f":"IF(Unc=\"\",\"\",Unc)","v":""},{"$f":"IF(kfactor=\"\",\"\",kfactor)","v":""},{"$f":"IF(Eff_df=\"\",\"\",Eff_df)","v":""},{"$f":"IF(SealNo=\"\",\"\",SealNo)","v":""}]
[]
[{"$f":"\"Table 2 - \"&Description&\" Temperature Correction Chart\"","v":"Table 2 -  Temperature Correction Chart"}]
[{"$f":"IF(RefTempUnit=\"Designated Reference Temperature For This Calibration (ºC)\",\"Coefficient of Cubical Expansion = \"&B&\" / ºC\",\"Coefficient of Cubical Expansion = \"&B&\" / ºF\")","v":"Coefficient of Cubical Expansion =  / ºF"},null,null,{"$f":"\"A negative error means the \"&Description&\" is small\n\n\n\nA \"&Description&\" is smaller at temperatures lower than the reference temperature\"","v":"A negative error means the  is small\n\n\n\nA  is smaller at temperatures lower than the reference temperature"}]
{"$rows_left_out":31}
{"sheet":"Prover Data Entry","index":6,"n_rows":86,"n_cols":11,"rows_kept":86,"merged":[[0,8,0,10],[2,0,2,1],[3,0,3,6],[3,7,3,9],[4,0,4,6],[4,8,4,10],[5,0,5,6],[5,8,5,10],[6,0,6,6],[6,8,6,10],[9,0,9,1],[9,2,9,5],[9,6,9,8],[9,9,9,10],[10,0,10,1],[10,2,10,5],[10,6,10,8],[10,9,10,10],[11,0,11,1],[11,2,11,3],[11,4,11,5],[11,6,11,8],[11,9,11,10],[12,0,12,4],[12,6,12,10],[13,0,13,1],[13,2,13,5],[13,6,13,8],[13,9,13,10],[14,0,14,1],[14,3,14,5],[14,7,14,9],[15,0,15,1],[15,2,15,6],[15,7,15,8],[15,9,15,10],[16,0,16,1],[16,2,16,4],[16,5,16,8],[16,9,16,10],[17,0,17,8],[17,9,17,10],[18,0,18,4],[18,5,18,6],[18,7,18,9],[19,0,19,4],[19,5,19,6],[20,0,20,4],[20,6,20,9],[21,0,21,1],[21,2,21,3],[21,5,21,7],[21,8,21,9],[24,1,24,4],[24,5,24,6],[24,7,24,8],[25,1,25,4],[25,5,25,6],[25,7,25,8],[26,1,26,4],[26,5,26,6],[26,7,26,8],[27,1,27,4],[27,5,27,6],[27,7,27,8],[28,1,28,4],[28,5,28,6],[28,7,28,8],[29,1,29,4],[29,5,29,6],[29,7,29,8],[30,1,30,4],[30,5,30,6],[30,7,30,8],[31,1,31,4],[31,5,31,6],[31,7,31,8],[32,1,32,4],[32,5,32,6],[32,7,32,8],[35,1,35,3],[35,5,35,6],[35,7,35,8],[36,1,36,3],[36,5,36,6],[36,7,36,8],[37,1,37,3],[37,5,37,6],[37,7,37,8],[38,1,38,3],[38,5,38,6],[38,7,38,8],[39,1,39,3],[39,5,39,6],[39,7,39,8],[41,1,41,3],[41,5,41,6],[42,1,42,3],[42,5,42,6],[43,1,43,3],[43,5,43,6],[44,1,44,3],[44,5,44,6],[45,1,45,3],[45,5,45,6],[48,0,48,3],[48,5,48,6],[48,7,48,8],[48,9,48,10],[49,0,49,3],[49,5,49,6],[49,7,49,8],[49,9,49,10],[50,0,50,3],[50,5,50,6],[50,7,50,8],[50,9,50,10],[53,1,53,2],[53,4,53,5],[56,0,56,4],[56,5,56,9],[75,0,75,4],[75,5,75,9],[76,0,76,3],[76,5,76,8],[77,0,77,3],[77,5,77,8],[78,0,78,3],[78,5,78,8],[79,0,79,3],[79,5,79,8],[80,0,80,3],[80,5,80,8],[81,0,81,4],[81,5,81,9],[82,0,82,3],[82,5,82,7],[82,8,82,9],[85,1,85,2],[85,4,85,5]]}
["Prover Data Entry",{"$nulls":6},"Report Number:"]
[]
["Customer Information"]
[{"$nulls":7},"Customer ID"]
[{"$nulls":7},"PO#"]
[{"$nulls":7},"POC"]
[{"$nulls":7},"Phone"]
[]
{"$rows_left_out":71}
{"sheet":"Control Data","index":7,"n_rows":4,"n_cols":11,"rows_kept":4}
["Control Chart Information",{"$nulls":9},{"$f":"IF(RptNo=\"\",\"\",\"Report Number: \"&RptNo)","v":""}]
["Note: Copy and Paste to Control Chart"]
["Tech. Initials","Date","Test Number",{"$f":"\"Volume (Trial 1) \"&IF(AND(RefTempUnit=\"Designated Reference Temperature For This Calibration (ºC)\",NomValUnit=\"Nominal Volume (L)\"),\"@ \"&RefT&\" ºC (L)\",IF(AND(RefTempUnit=\"Designated Reference Temperature For This Calibration (ºF)\",NomValUnit=\"Nominal Volume (L)\"),\"@ \"&RefT&\" ºF (L)\",IF(AND(RefTempUnit=\"Designated Reference Temperature For This Calibration (ºC)\",NomValUnit=\"Nominal Volume (gal)\"),\"@ \"&RefT&\" ºC (gal)\",IF(AND(RefTempUnit=\"Designated Reference Temperature For This Calibration (ºF)\",NomValUnit=\"Nominal Volume (gal)\"),\"@ \"&RefT&\" ºF (gal)\"))))","v":"Volume (Trial 1) FALSE"},{"$f":"\"Volume (Trial 2) \"&IF(AND(RefTempUnit=\"Designated Reference Temperature For This Calibration (ºC)\",NomValUnit=\"Nominal Volume (L)\"),\"@ \"&RefT&\" ºC (L)\",IF(AND(RefTempUnit=\"Designated Reference Temperature For This Calibration (ºF)\",NomValUnit=\"Nominal Volume (L)\"),\"@ \"&RefT&\" ºF (L)\",IF(AND(RefTempUnit=\"Designated Reference Temperature For This Calibration (ºC)\",NomValUnit=\"Nominal Volume (gal)\"),\"@ \"&RefT&\" ºC (gal)\",IF(AND(RefTempUnit=\"Designated Reference Temperature For This Calibration (ºF)\",NomValUnit=\"Nominal Volume (gal)\"),\"@ \"&RefT&\" ºF (gal)\"))))","v":"Volume (Trial 2) FALSE"},"Start Humidity (% RH)","Finish Humidity (% RH)","Start Air Temp. (ºC)","Finish Air Temp. (ºC)","Water Temp. (Trial 1) (ºC)","Water Temp. (Trial 2) (ºC)"]
[{"$f":"IF('Prover Data Entry'!K22=\"\",\"\",'Prover Data Entry'!K22)","v":""},{"$f":"IF(Cal_Date=\"\",\"\",Cal_Date)","v":""},{"$f":"IF(RptNo=\"\",\"\",RptNo)","v":""},{"$f":"Calculations!E30","v":""},{"$f":"Calculations!E31","v":""},{"$f":"IF(Humidity=\"\",\"\",Humidity)","v":""},{"$f":"IF(Humidity_F=\"\",\"\",Humidity_F)","v":""},{"$f":"IF(AirTemp=\"\",\"\",AirTemp)","v":""},{"$f":"IF(AirTemp_F=\"\",\"\",AirTemp_F)","v":""},{"$f":"IF(ISERROR(t_1+ProverTempCorr),\"\",t_1+ProverTempCorr)","v":""},{"$f":"IF(ISERROR(t_2+ProverTempCorr),\"\",t_2+ProverTempCorr)","v":""}]

{"sheet":"Calculations","index":8,"n_rows":62,"n_cols":10,"rows_kept":62,"merged":[[3,0,3,4],[3,5,3,9],[20,0,20,3],[20,5,20,8],[21,0,21,4],[21,5,21,9],[22,0,22,2],[22,3,22,4],[22,5,22,7],[22,8,22,9],[23,0,23,2],[23,3,23,4],[23,5,23,7],[23,8,23,9],[26,4,26,5],[27,4,27,5],[28,4,28,5],[29,4,29,5],[30,4,30,5],[33,0,33,9],[34,4,34,5],[34,7,35,9],[35,4,35,5],[38,0,38,9],[39,4,39,5],[40,4,40,5],[40,7,40,9],[41,4,41,5],[41,7,41,9],[44,0,44,9],[45,4,45,5],[45,7,46,9],[46,4,46,5],[49,0,49,9],[50,4,50,5],[50,7,52,9],[51,4,51,5],[52,4,52,5],[55,4,55,5],[56,4,56,5],[57,4,57,5],[58,4,58,5],[59,4,59,5],[60,4,60,5],[61,4,61,5]]}
["Calculations",{"$nulls":8},{"$f":"IF(RptNo=\"\",\"\",\"Report Number: \"&RptNo)","v":""}]
[]
["Measurement Trial Calculations"]
["Volume Standard(s) Trial 1",{"$nulls":4},"Volume Standard(s) Trial 2"]
["Drop #",{"$f":"IF(RefTempUnit=\"Designated Reference Temperature For This Calibration (ºC)\",\"Std. Ref. Temp. (trefS ºC)\",\"Std. Ref. Temp. (trefS ºF)\")","v":"Std. Ref. Temp. (trefS ºF)"},{"$f":"IF(RefTempUnit=\"Designated Reference Temperature For This Calibration (ºC)\",\"Water Temp.\n(ºC)\",\"Water Temp.\n(ºF)\")","v":"Water Temp.\n(ºF)"},"Water Density (g/cm³)",{"$f":"IF(NomValUnit=\"\",\"Delivered\nVolume\",IF(NomValUnit=\"Nominal Volume (L)\",\"Delivered\nVolume\n(L)\",\"Delivered\nVolume\n(gal)\"))","v":"Delivered\nVolume"},"Drop #",{"$f":"IF(RefTempUnit=\"Designated Reference Temperature For This Calibration (ºC)\",\"Std. Ref. Temp. (trefS ºC)\",\"Std. Ref. Temp. (trefS ºF)\")","v":"Std. Ref. Temp. (trefS ºF)"},{"$f":"IF(RefTempUnit=\"Designated Reference Temperature For This Calibration (ºC)\",\"Water Temp.\n(ºC)\",\"Water Temp.\n(ºF)\")","v":"Water Temp.\n(ºF)"},"Water Density (g/cm³)",{"$f":"IF(NomValUnit=\"\",\"Delivered\nVolume\",IF(NomValUnit=\"Nominal Volume (L)\",\"Delivered\nVolume\n(L)\",\"Delivered\nVolume\n(gal)\"))","v":"Delivered\nVolume"}]
[1,{"$f":"IF('Prover Data Entry'!B59=\"\",\"\",VLOOKUP('Prover Data Entry'!B59,Standards_Table_B,5,FALSE))","v":""},{"$f":"IF('Prover Data Entry'!B59=\"\",\"\",IF(RefTempUnit=\"Designated Reference Temperature For This Calibration (ºC)\",'Prover Data Entry'!D59+StdTempCorr,('Prover Data Entry'!D59+StdTempCorr)*1.8+32))","v":""},{"$f":"IF('Prover Data Entry'!B59=\"\",\"\",ROUND((999.97495*(1-((('Prover Data Entry'!D59+StdTempCorr)-3.983035)^2*(('Prover Data Entry'!D59+StdTempCorr)+301.797))/(522528.9*(('Prover Data Entry'!D59+StdTempCorr)+69.34881))))/1000+(-4.612+0.106*('Prover Data Entry'!D59+StdTempCorr))/1000000,8))","v":""},{"$f":"IF('Prover Data Entry'!B59=\"\",\"\",IF(NomValUnit=\"Nominal Volume (L)\",D6*(('Prover Data Entry'!C59+('Prover Data Entry'!E59/1000))*(1+(VLOOKUP('Prover Data Entry'!B59,Standards_Table_B,6,FALSE))*(C6-B6))),D6*(('Prover Data Entry'!C59+('Prover Data Entry'!E59/231))*(1+(VLOOKUP('Prover Data Entry'!B59,Standards_Table_B,6,FALSE))*(C6-B6)))))","v":""},1,{"$f":"IF('Prover Data Entry'!G59=\"\",\"\",VLOOKUP('Prover Data Entry'!G59,Standards_Table_B,5,FALSE))","v":""},{"$f":"IF('Prover Data Entry'!G59=\"\",\"\",IF(RefTempUnit=\"Designated Reference Temperature For This Calibration (ºC)\",'Prover Data Entry'!I59+StdTempCorr,('Prover Data Entry'!I59+StdTempCorr)*1.8+32))","v":""},{"$f":"IF('Prover Data Entry'!G59=\"\",\"\",ROUND((999.97495*(1-((('Prover Data Entry'!I59+StdTempCorr)-3.983035)^2*(('Prover Data Entry'!I59+StdTempCorr)+301.797))/(522528.9*(('Prover Data Entry'!I59+StdTempCorr)+69.34881))))/1000+(-4.612+0.106*('Prover Data Entry'!I59+StdTempCorr))/1000000,8))","v":""},{"$f":"IF('Prover Data Entry'!G59=\"\",\"\",IF(NomValUnit=\"Nominal Volume (L)\",I6*(('Prover Data Entry'!H59+('Prover Data Entry'!J59/1000))*(1+(VLOOKUP('Prover Data Entry'!G59,Standards_Table_B,6,FALSE))*(H6-G6))),I6*(('Prover Data Entry'!H59+('Prover Data Entry'!J59/231))*(1+(VLOOKUP('Prover Data Entry'!G59,Standards_Table_B,6,FALSE))*(H6-G6)))))","v":""}]
[2,{"$f":"IF('Prover Data Entry'!B60=\"\",\"\",VLOOKUP('Prover Data Entry'!B60,Standards_Table_B,5,FALSE))","v":""},{"$f":"IF('Prover Data Entry'!B60=\"\",\"\",IF(RefTempUnit=\"Designated Reference Temperature For This Calibration (ºC)\",'Prover Data Entry'!D60+StdTempCorr,('Prover Data Entry'!D60+StdTempCorr)*1.8+32))","v":""},{"$f":"IF('Prover Data Entry'!B60=\"\",\"\",ROUND((999.97495*(1-((('Prover Data Entry'!D60+StdTempCorr)-3.983035)^2*(('Prover Data Entry'!D60+StdTempCorr)+301.797))/(522528.9*(('Prover Data Entry'!D60+StdTempCorr)+69.34881))))/1000+(-4.612+0.106*('Prover Data Entry'!D60+StdTempCorr))/1000000,8))","v":""},{"$f":"IF('Prover Data Entry'!B60=\"\",\"\",IF(NomValUnit=\"Nominal Volume (L)\",D7*(('Prover Data Entry'!C60+('Prover Data Entry'!E60/1000))*(1+(VLOOKUP('Prover Data Entry'!B60,Standards_Table_B,6,FALSE))*(C7-B7))),D7*(('Prover Data Entry'!C60+('Prover Data Entry'!E60/231))*(1+(VLOOKUP('Prover Data Entry'!B60,Standards_Table_B,6,FALSE))*(C7-B7)))))","v":""},2,{"$f":"IF('Prover Data Entry'!G60=\"\",\"\",VLOOKUP('Prover Data Entry'!G60,Standards_Table_B,5,FALSE))","v":""},{"$f":"IF('Prover Data Entry'!G60=\"\",\"\",IF(RefTempUnit=\"Designated Reference Temperature For This Calibration (ºC)\",'Prover Data Entry'!I60+StdTempCorr,('Prover Data Entry'!I60+StdTempCorr)*1.8+32))","v":""},{"$f":"IF('Prover Data Entry'!G60=\"\",\"\",ROUND((999.97495*(1-((('Prover Data Entry'!I60+StdTempCorr)-3.983035)^2*(('Prover Data Entry'!I60+StdTempCorr)+301.797))/(522528.9*(('Prover Data Entry'!I60+StdTempCorr)+69.34881))))/1000+(-4.612+0.106*('Prover Data Entry'!I60+StdTempCorr))/1000000,8))","v":""},{"$f":"IF('Prover Data Entry'!G60=\"\",\"\",IF(NomValUnit=\"Nominal Volume (L)\",I7*(('Prover Data Entry'!H60+('Prover Data Entry'!J60/1000))*(1+(VLOOKUP('Prover Data Entry'!G60,Standards_Table_B,6,FALSE))*(H7-G7))),I7*(('Prover Data Entry'!H60+('Prover Data Entry'!J60/231))*(1+(VLOOKUP('Prover Data Entry'!G60,Standards_Table_B,6,FALSE))*(H7-G7)))))","v":""}]
[3,{"$f":"IF('Prover Data Entry'!B61=\"\",\"\",VLOOKUP('Prover Data Entry'!B61,Standards_Table_B,5,FALSE))","v":""},{"$f":"IF('Prover Data Entry'!B61=\"\",\"\",IF(RefTempUnit=\"Designated Reference Temperature For This Calibration (ºC)\",'Prover Data Entry'!D61+StdTempCorr,('Prover Data Entry'!D61+StdTempCorr)*1.8+32))","v":""},{"$f":"IF('Prover Data Entry'!B61=\"\",\"\",ROUND((999.97495*(1-((('Prover Data Entry'!D61+StdTempCorr)-3.983035)^2*(('Prover Data Entry'!D61+StdTempCorr)+301.797))/(522528.9*(('Prover Data Entry'!D61+StdTempCorr)+69.34881))))/1000+(-4.612+0.106*('Prover Data Entry'!D61+StdTempCorr))/1000000,8))","v":""},{"$f":"IF('Prover Data Entry'!B61=\"\",\"\",IF(NomValUnit=\"Nominal Volume (L)\",D8*(('Prover Data Entry'!C61+('Prover Data Entry'!E61/1000))*(1+(VLOOKUP('Prover Data Entry'!B61,Standards_Table_B,6,FALSE))*(C8-B8))),D8*(('Prover Data Entry'!C61+('Prover Data Entry'!E61/231))*(1+(VLOOKUP('Prover Data Entry'!B61,Standards_Table_B,6,FALSE))*(C8-B8)))))","v":""},3,{"$f":"IF('Prover Data Entry'!G61=\"\",\"\",VLOOKUP('Prover Data Entry'!G61,Standards_Table_B,5,FALSE))","v":""},{"$f":"IF('Prover Data Entry'!G61=\"\",\"\",IF(RefTempUnit=\"Designated Reference Temperature For This Calibration (ºC)\",'Prover Data Entry'!I61+StdTempCorr,('Prover Data Entry'!I61+StdTempCorr)*1.8+32))","v":""},{"$f":"IF('Prover Data Entry'!G61=\"\",\"\",ROUND((999.97495*(1-((('Prover Data Entry'!I61+StdTempCorr)-3.983035)^2*(('Prover Data Entry'!I61+StdTempCorr)+301.797))/(522528.9*(('Prover Data Entry'!I61+StdTempCorr)+69.34881))))/1000+(-4.612+0.106*('Prover Data Entry'!I61+StdTempCorr))/1000000,8))","v":""},{"$f":"IF('Prover Data Entry'!G61=\"\",\"\",IF(NomValUnit=\"Nominal Volume (L)\",I8*(('Prover Data Entry'!H61+('Prover Data Entry'!J61/1000))*(1+(VLOOKUP('Prover Data Entry'!G61,Standards_Table_B,6,FALSE))*(H8-G8))),I8*(('Prover Data Entry'!H61+('Prover Data Entry'!J61/231))*(1+(VLOOKUP('Prover Data Entry'!G61,Standards_Table_B,6,FALSE))*(H8-G8)))))","v":""}]
{"$rows_left_out":55}
{"sheet":"Uncertainty Analysis","index":9,"n_rows":102,"n_cols":12,"rows_kept":102,"merged":[[0,2,0,5],[11,2,11,11],[12,2,12,11],[13,2,13,11],[14,2,14,11],[15,2,15,11],[16,2,16,11],[17,2,17,11],[18,2,18,11],[19,2,19,11],[22,1,22,5],[22,6,22,11],[23,1,23,5],[23,6,23,11],[24,1,24,5],[24,6,24,11],[25,1,25,5],[25,6,25,11],[26,1,26,5],[26,6,26,11],[27,1,27,5],[27,6,27,11],[28,1,28,5],[28,6,28,11],[31,0,31,2],[31,3,31,4],[31,8,31,9],[32,0,32,2],[33,0,33,2],[35,0,35,2],[35,3,35,5],[35,6,35,7],[36,0,36,2],[36,3,36,4],[36,8,36,9],[38,0,38,2],[42,0,42,2],[42,3,42,5],[42,6,42,7],[42,8,42,9],[42,10,42,11],[43,0,43,2],[58,10,58,11],[59,0,59,2],[59,3,59,5],[61,0,61,2],[77,0,77,2],[80,0,80,1],[81,0,81,1],[82,0,82,1],[83,0,83,1],[84,0,84,1],[85,0,85,1],[86,0,86,1],[87,0,87,1],[88,0,88,1],[89,0,89,1],[90,0,90,1]]}
["Uncertainty Analysis",{"$nulls":10},{"$f":"IF(RptNo=\"\",\"\",\"Report Number: \"&RptNo)","v":""}]
[]
["Specify Procedure"]
["NISTIR 7383, SOP 19, Calibration of Large Neck-Type Metal Provers - Volumetric Method"]
[]
["Specify Equation(s)"]
["Volume at the Reference Temperature"]
[]
{"$rows_left_out":95}
{"sheet":"Tables & Lists","index":10,"n_rows":32,"n_cols":7,"rows_kept":32,"merged":[[2,0,2,1],[29,0,29,6],[30,0,30,6],[31,0,31,6]]}
["Tables & Lists",{"$nulls":5},{"$f":"IF(RptNo=\"\",\"\",\"Report Number: \"&RptNo)","v":""}]
[]
["Cubical Coefficient of Expansion Table\n(CCE_Table) &\nMaterial List\n(Material_List)",null,null," Pick Lists\nfor\nData Validation Cells"]
["Material","cm³/ºF",null,"Graduated Neck Volume (gal)"]
["Aluminum",3.8e-05,null,"Graduated Neck Volume (L)"]
["Plastic, Polypropylene",0.00024]
["Steel, Prover, Low Carbon",1.86e-05,null,"Scale Graduations (L)"]
["Steel, Stainless",2.65E-5,null,"Scale Graduations (mL)"]
{"$rows_left_out":24}