{"text_format":"3","workbook":"xlsx","n_sheets":16,"sheets":["Software Technical Assessment","Documentation","SOP 21","Instructions","Report Pages 1-3","Report Pages 4-5","Report Page 6","Report Page 7","Report Page 8","Prover Data Entry","Control Data","Calculations","Pressure Corrections","Water Compressability","Uncertainty Analysis","Tables & Lists"],"not_rendered":{"charts":2,"images":10,"external_links":5,"defined_names":155,"comments":3},"read":"whole","date_system":"1900"}

{"sheet":"Software Technical Assessment","index":0,"n_rows":49,"n_cols":4,"rows_kept":49,"merged":[[5,0,17,0],[18,0,21,0],[22,0,25,0],[26,0,28,0],[29,0,34,0],[35,0,38,0],[39,0,40,0],[43,0,48,0],[56,4,56,5]]}
["Software Technical Assessment"]
[]
["Software Description","WAMRF-014 (Rev. 35), SOP 21 Workbook","Approval Date","2015-12-28"]
["Assessed By","Dan Wright","Approved By","Dan Wright"]
["Codes","Assessment","Pass/Fail","Evidence"]
["A. Software Inspection","Spreadsheet is clear and makes sense","Pass","All worksheet are appropriately named and easy to understand"]
[null,"There are instructions for use ","Pass","Instructions worksheet"]
[null,"Instructions and data input appear on the visible portion of the first worksheet","Pass","The workbook opens to the instructions worksheet"]
{"$rows_left_out":42}
{"sheet":"Documentation","index":1,"n_rows":93,"n_cols":3,"rows_kept":93}
["Documentation"]
["Date","Description","Initials"]
["2004-01-30","This workbook was developed by Dan Wright, Washington State Department of Agriculture Metrology Laboratory. It follows the procedure documented in NISTIR 7383, SOP 21. NIST/WMD has evaluated this spreadsheet and provided useful feedback in its development.","DAW"]
["2004-03-03","Updated water density formula to the Patterson/Morris equation.","DAW"]
["2004-03-05","Updated water density formula to the Patterson/Morris equation on the 'Uncertainty Analysis' worksheet.","DAW"]
["2004-03-11","Made suggested changed from NIST, WMD. Revised pressure measurements.","DAW"]
["2004-07-06","Updated uncertainty analysis to new format.","DAW"]
["2004-09-10","Updated uncertainty analysis.","DAW"]
{"$rows_left_out":86}
{"sheet":"SOP 21","index":2,"n_rows":0,"n_cols":0,"rows_kept":0}

{"sheet":"Instructions","index":3,"n_rows":107,"n_cols":2,"rows_kept":107,"merged":[[0,0,0,1],[9,0,9,1]]}
["Instructions"]
["No.","Description"]
[1,"This workbook is for calibration of LPG provers at a reference temperature of 60 ºF which is the US industry standard for LP Gases."]
[null,"Tables 2 and 4 are based on a Specific Gravity 60/60 ºF 0.505, which is the approximate specific gravity for commerical grade LP Propane."]
[null,"This workbook must be validated after any changes or modifications."]
[2,"The worksheets are password protected. Password is password. You should protect each sheet with your own unique password. Place a password hint here so you don't forget it. Password hint is: \"?\""]
[3,"Validate all links and ranges after any changes and during annual reviews."]
[4,"Modify the report pages with your laboratory and accreditation authority information."]
{"$rows_left_out":100}
{"sheet":"Report Pages 1-3","index":4,"n_rows":95,"n_cols":7,"rows_kept":95,"merged":[[32,0,33,6],[37,5,37,6],[40,0,40,1],[40,2,40,6],[41,0,41,6],[56,3,56,4],[57,0,57,1],[57,3,57,4],[58,0,58,1],[58,3,58,4],[59,0,59,1],[59,3,59,4],[60,0,60,1],[60,3,60,4],[61,0,61,1],[61,3,61,4],[62,0,62,1],[62,3,62,4],[63,0,63,1],[63,3,63,4],[64,0,64,1],[64,3,64,4],[67,0,67,6],[70,0,70,6],[73,0,73,6],[74,0,74,6],[78,0,78,6],[79,0,79,6],[80,0,80,6],[81,0,81,6],[82,0,82,6],[83,0,83,6],[84,0,84,6],[85,0,85,6],[86,0,86,6],[91,0,91,2],[91,3,91,4],[91,5,91,6],[92,0,92,2],[92,3,92,4],[92,5,92,6],[93,0,93,2],[93,3,93,4],[93,5,93,6],[94,0,94,2],[94,3,94,4],[94,5,94,6]]}
{"$rows_empty":10}
[{"$nulls":3},"REPORT OF CALIBRATION"]
[]
[{"$nulls":3},"Issued To:"]
[{"$nulls":3},{"$f":"IF('Prover Data Entry'!A4=\"\",\"\",'Prover Data Entry'!A4)","v":""}]
[{"$nulls":3},{"$f":"IF('Prover Data Entry'!A5=\"\",\"\",'Prover Data Entry'!A5)","v":""}]
[{"$nulls":3},{"$f":"IF('Prover Data Entry'!A6=\"\",\"\",'Prover Data Entry'!A6)","v":""}]
[{"$nulls":3},{"$f":"IF('Prover Data Entry'!A7=\"\",\"\",'Prover Data Entry'!A7)","v":""}]
{"$rows_left_out":79}
{"sheet":"Report Pages 4-5","index":5,"n_rows":32,"n_cols":5,"rows_kept":32,"merged":[[0,0,0,4]]}
["WSDA Weights and Measures Metrology Laboratory"]
[{"$f":"\"Report Number: \"&RptNo","v":"Report Number: "},{"$nulls":3},{"$f":"IF(Cal_Date=\"\",\"Calibration Date\",\"Calibration Date: \"&TEXT(Cal_Date,\"mmmm d, yyyy\"))","v":"Calibration Date"}]
["Calibration Results"]
["Nominal Volume\n(at zero mark on gauge)",{"$f":"\"Prover Volume As Found @ 60 ºF and 100 psig\"&IF(NomValUnit=\"Nominal Volume (L)\",\" (L)\",\" (gal)\")","v":"Prover Volume As Found @ 60 ºF and 100 psig (gal)"},{"$f":"\"Prover Volume As Left @ 60 ºF and 100 psig\"&IF(NomValUnit=\"Nominal Volume (L)\",\" (L)\",\" (gal)\")","v":"Prover Volume As Left @ 60 ºF and 100 psig (gal)"},{"$f":"IF(NomValUnit=\"Nominal Volume (L)\",\"NIST HB 105-4\nSpecification Tolerance\n\"&CHAR(177)&\" (L)\",\"NIST HB 105-4\nSpecification Tolerance\n\"&CHAR(177)&\" (gal)\")","v":"NIST HB 105-4\nSpecification Tolerance\n± (gal)"},{"$f":"IF(NomValUnit=\"Nominal Volume (L)\",\"Uncertainty\n(k=\"&kfactor&\")\n± (L)\",\"Uncertainty\n(k=\"&kfactor&\")\n(df=\"&Eff_df&\")\n± (gal)\")","v":"Uncertainty\n(k=)\n(df=)\n± (gal)"}]
[{"$f":"IF(Nom_Val=\"\",\"\",IF(NomValUnit=\"Nominal Volume (L)\",Nom_Val&\" L\",Nom_Val&\" gal\"))","v":""},{"$f":"IF(AsFound=\"\",\"\",AsFound)","v":""},{"$f":"IF(AsLeft=\"\",\"\",IF(Adjusted=\"Yes\",FIXED(Nom_Val,2-1-INT(LOG10(ABS(Final_U))),TRUE),AsLeft))","v":""},{"$f":"IF(Tolerance=\"\",\"\",Tolerance)","v":""},{"$f":"Unc","v":""}]
[]
[{"$f":"\"Table 1 - \"&IF(NomValUnit=\"Nominal Volume (L)\",Nom_Val&\" L LPG Prover Corrections @ 60 ºF\",Nom_Val&\" gal LPG Prover Corrections @ 60 ºF\")","v":"Table 1 -  gal LPG Prover Corrections @ 60 ºF"}]
[{"$f":"'Pressure Corrections'!A20","v":"psig"},{"$f":"'Pressure Corrections'!B20","v":"Prover Scale Reading \n(in³)"},{"$f":"'Pressure Corrections'!C20","v":"Pressure Correction (Pcorr) \n(in³)"},{"$f":"IF(Adjusted=\"Yes\",'Pressure Corrections'!D20,'Pressure Corrections'!E20)","v":"Prover Error \n(Not Adjusted) \n(gal)"},{"$f":"'Pressure Corrections'!F20","v":"Prover Volume \n(Not Adjusted) \n(gal)"}]
{"$rows_left_out":25}
{"sheet":"Report Page 6","index":6,"n_rows":34,"n_cols":12,"rows_kept":34,"merged":[[0,0,0,11],[1,5,1,6],[4,0,4,11],[5,0,5,11]]}
["WSDA Weights and Measures Metrology Laboratory"]
[{"$f":"\"Report Number: \"&RptNo","v":"Report Number: "},{"$nulls":4},{"$f":"IF(Nom_Val=\"\",\"\",Nom_Val&\" \"&IF(NomValUnit=\"Nominal Volume (L)\",\"L\",\"gal\")&\" LPG Prover\")","v":""},{"$nulls":5},{"$f":"IF(Cal_Date=\"\",\"Calibration Date\",\"Calibration Date: \"&TEXT(Cal_Date,\"mmmm d, yyyy\"))","v":"Calibration Date"}]
[]
["Table 2 - LPG Temperature Corrections"]
["Correction Per ºF Difference between Meter Temperature and Prover Temperature"]
["Propane Specific Gravity 60/60 ºF 0.505*"]
["Liquid in Prover Temp. ºF","in³ / ºF","gal / ºF","Liquid in Prover Temp. ºF","in³ / ºF","gal / ºF","Liquid in Prover Temp. ºF","in³ / ºF","gal / ºF","Liquid in Prover Temp. ºF","in³ / ºF","gal / ºF"]
[0,{"$f":"IF(NomValUnit=\"\",\"\",IF(NomValUnit=\"Nominal Volume (L)\",FIXED((0.00163/'Report Page 8'!B7)*Nom_Val*1000,3),FIXED((0.00163/'Report Page 8'!B7)*Nom_Val*231,3)))","v":""},{"$f":"IF(NomValUnit=\"\",\"\",IF(NomValUnit=\"Nominal Volume (L)\",FIXED(B8/1000,3-1-INT(LOG10(ABS(Final_U))),TRUE),FIXED(B8/231,3-1-INT(LOG10(ABS(Final_U))),TRUE)))","v":""},26,{"$f":"IF(NomValUnit=\"\",\"\",IF(NomValUnit=\"Nominal Volume (L)\",FIXED((0.00163/'Report Page 8'!D7)*Nom_Val*1000,3),FIXED((0.00163/'Report Page 8'!D7)*Nom_Val*231,3)))","v":""},{"$f":"IF(NomValUnit=\"\",\"\",IF(NomValUnit=\"Nominal Volume (L)\",FIXED(E8/1000,3-1-INT(LOG10(ABS(Final_U))),TRUE),FIXED(E8/231,3-1-INT(LOG10(ABS(Final_U))),TRUE)))","v":""},52,{"$f":"IF(NomValUnit=\"\",\"\",IF(NomValUnit=\"Nominal Volume (L)\",FIXED((0.00163/'Report Page 8'!F7)*Nom_Val*1000,3),FIXED((0.00163/'Report Page 8'!F7)*Nom_Val*231,3)))","v":""},{"$f":"IF(NomValUnit=\"\",\"\",IF(NomValUnit=\"Nominal Volume (L)\",FIXED(H8/1000,3-1-INT(LOG10(ABS(Final_U))),TRUE),FIXED(H8/231,3-1-INT(LOG10(ABS(Final_U))),TRUE)))","v":""},78,{"$f":"IF(NomValUnit=\"\",\"\",IF(NomValUnit=\"Nominal Volume (L)\",FIXED((0.00163/'Report Page 8'!H7)*Nom_Val*1000,3),FIXED((0.00163/'Report Page 8'!H7)*Nom_Val*231,3)))","v":""},{"$f":"IF(NomValUnit=\"\",\"\",IF(NomValUnit=\"Nominal Volume (L)\",FIXED(K8/1000,3-1-INT(LOG10(ABS(Final_U))),TRUE),FIXED(K8/231,3-1-INT(LOG10(ABS(Final_U))),TRUE)))","v":""}]
{"$rows_left_out":27}
{"sheet":"Report Page 7","index":7,"n_rows":32,"n_cols":12,"rows_kept":32,"merged":[[0,0,0,11],[1,5,1,6],[4,0,4,11]]}
["WSDA Weights and Measures Metrology Laboratory"]
[{"$f":"\"Report Number: \"&RptNo","v":"Report Number: "},{"$nulls":4},{"$f":"IF(Nom_Val=\"\",\"\",Nom_Val&\" \"&IF(NomValUnit=\"Nominal Volume (L)\",\"L\",\"gal\")&\" LPG Prover\")","v":""},{"$nulls":5},{"$f":"IF(Cal_Date=\"\",\"Calibration Date\",\"Calibration Date: \"&TEXT(Cal_Date,\"mmmm d, yyyy\"))","v":"Calibration Date"}]
[]
["Table 3 - Volume Corrections for Thermal Expansion or Contraction of Prover"]
[{"$f":"\"Coefficient of Cubical Expansion = \"&B&\" / ºF\"","v":"Coefficient of Cubical Expansion =  / ºF"}]
["Temperature ºF",{"$f":"IF(NomValUnit=\"Nominal Volume (L)\",\"Correction (mL)\",\"Correction (in³)\")","v":"Correction (in³)"},{"$f":"IF(NomValUnit=\"Nominal Volume (L)\",\"Correction (L)\",\"Correction (gal)\")","v":"Correction (gal)"},"Temperature ºF",{"$f":"IF(NomValUnit=\"Nominal Volume (L)\",\"Correction (mL)\",\"Correction (in³)\")","v":"Correction (in³)"},{"$f":"IF(NomValUnit=\"Nominal Volume (L)\",\"Correction (L)\",\"Correction (gal)\")","v":"Correction (gal)"},"Temperature ºF",{"$f":"IF(NomValUnit=\"Nominal Volume (L)\",\"Correction (mL)\",\"Correction (in³)\")","v":"Correction (in³)"},{"$f":"IF(NomValUnit=\"Nominal Volume (L)\",\"Correction (L)\",\"Correction (gal)\")","v":"Correction (gal)"},"Temperature ºF",{"$f":"IF(NomValUnit=\"Nominal Volume (L)\",\"Correction (mL)\",\"Correction (in³)\")","v":"Correction (in³)"},{"$f":"IF(NomValUnit=\"Nominal Volume (L)\",\"Correction (L)\",\"Correction (gal)\")","v":"Correction (gal)"}]
[0,{"$f":"IF(NomValUnit=\"\",\"\",IF(NomValUnit=\"Nominal Volume (L)\",FIXED((Nom_Val*(1+(B*(A7-60)))-Nom_Val)*1000,1),FIXED((Nom_Val*(1+(B*(A7-60)))-Nom_Val)*231,1)))","v":""},{"$f":"IF(Nom_Val=\"\",\"\",FIXED(Nom_Val*(1+(B*(A7-60)))-Nom_Val,2-1-INT(LOG10(ABS(Final_U))),TRUE))","v":""},26,{"$f":"IF(NomValUnit=\"\",\"\",IF(NomValUnit=\"Nominal Volume (L)\",FIXED((Nom_Val*(1+(B*(D7-60)))-Nom_Val)*1000,1),FIXED((Nom_Val*(1+(B*(D7-60)))-Nom_Val)*231,1)))","v":""},{"$f":"IF(Nom_Val=\"\",\"\",FIXED(Nom_Val*(1+(B*(D7-60)))-Nom_Val,2-1-INT(LOG10(ABS(Final_U))),TRUE))","v":""},52,{"$f":"IF(NomValUnit=\"\",\"\",IF(NomValUnit=\"Nominal Volume (L)\",FIXED((Nom_Val*(1+(B*(G7-60)))-Nom_Val)*1000,1),FIXED((Nom_Val*(1+(B*(G7-60)))-Nom_Val)*231,1)))","v":""},{"$f":"IF(Nom_Val=\"\",\"\",FIXED(Nom_Val*(1+(B*(G7-60)))-Nom_Val,2-1-INT(LOG10(ABS(Final_U))),TRUE))","v":""},78,{"$f":"IF(NomValUnit=\"\",\"\",IF(NomValUnit=\"Nominal Volume (L)\",FIXED((Nom_Val*(1+(B*(J7-60)))-Nom_Val)*1000,1),FIXED((Nom_Val*(1+(B*(J7-60)))-Nom_Val)*231,1)))","v":""},{"$f":"IF(Nom_Val=\"\",\"\",FIXED(Nom_Val*(1+(B*(J7-60)))-Nom_Val,2-1-INT(LOG10(ABS(Final_U))),TRUE))","v":""}]
[1,"","",27,"","",53,"","",79,"",""]
{"$rows_left_out":25}
{"sheet":"Report Page 8","index":8,"n_rows":33,"n_cols":8,"rows_kept":33,"merged":[[0,0,0,7],[1,3,1,4],[4,0,4,7]]}
["WSDA Weights and Measures Metrology Laboratory"]
[{"$f":"\"Report Number: \"&RptNo","v":"Report Number: "},null,null,{"$f":"IF(Nom_Val=\"\",\"\",Nom_Val&\" \"&IF(NomValUnit=\"Nominal Volume (L)\",\"L\",\"gal\")&\" LPG Prover\")","v":""},{"$nulls":3},{"$f":"IF(Cal_Date=\"\",\"Calibration Date\",\"Calibration Date: \"&TEXT(Cal_Date,\"mmmm d, yyyy\"))","v":"Calibration Date"}]
[]
["Table 4 - Volume Correction Factors to 60 ºF"]
["Propane Specific Gravity 60/60 ºF 0.505*"]
["Temperature ºF","Correction Factor","Temperature ºF","Correction Factor","Temperature ºF","Correction Factor","Temperature ºF","Correction Factor"]
[0,1.09008,26,1.05283,52,1.01293,78,0.96955]
[1,1.08869,27,1.05134,53,1.01133,79,{"v":0.9678,"d":"0.96780"}]
{"$rows_left_out":26}
{"sheet":"Prover Data Entry","index":9,"n_rows":111,"n_cols":11,"rows_kept":111,"merged":[[0,8,0,10],[3,0,3,6],[3,7,3,9],[4,0,4,6],[4,8,4,10],[5,0,5,6],[5,8,5,10],[6,0,6,6],[6,8,6,10],[9,0,9,1],[9,2,9,5],[9,6,9,8],[9,9,9,10],[10,0,10,1],[10,2,10,5],[10,6,10,8],[10,9,10,10],[11,0,11,1],[11,2,11,3],[11,4,11,5],[11,6,11,8],[11,9,11,10],[12,0,12,4],[12,6,12,10],[13,0,13,1],[13,2,13,5],[13,6,13,7],[13,8,13,9],[14,0,14,1],[14,3,14,5],[14,7,14,9],[15,0,15,1],[15,2,15,6],[15,7,15,8],[15,9,15,10],[16,0,16,8],[16,9,16,10],[17,0,17,4],[17,5,17,6],[17,7,17,9],[18,0,18,4],[18,5,18,6],[19,0,19,4],[19,6,19,9],[20,0,20,1],[20,2,20,3],[20,5,20,7],[20,8,20,9],[23,1,23,4],[23,5,23,6],[23,7,23,8],[24,1,24,4],[24,5,24,6],[24,7,24,8],[25,1,25,4],[25,5,25,6],[25,7,25,8],[26,1,26,4],[26,5,26,6],[26,7,26,8],[27,1,27,4],[27,5,27,6],[27,7,27,8],[28,1,28,4],[28,5,28,6],[28,7,28,8],[29,1,29,4],[29,5,29,6],[29,7,29,8],[30,1,30,4],[30,5,30,6],[30,7,30,8],[31,1,31,4],[31,5,31,6],[31,7,31,8],[34,1,34,3],[34,5,34,6],[34,7,34,8],[35,1,35,3],[35,5,35,6],[35,7,35,8],[36,1,36,3],[36,5,36,6],[36,7,36,8],[37,1,37,3],[37,5,37,6],[37,7,37,8],[38,1,38,3],[38,5,38,6],[38,7,38,8],[40,1,40,3],[40,5,40,6],[41,1,41,3],[41,5,41,6],[42,1,42,3],[42,5,42,6],[43,1,43,3],[43,5,43,6],[44,1,44,3],[44,5,44,6],[47,0,47,3],[47,5,47,6],[47,7,47,8],[47,9,47,10],[48,0,48,3],[48,5,48,6],[48,7,48,8],[48,9,48,10],[49,0,49,3],[49,5,49,6],[49,7,49,8],[49,9,49,10],[52,1,52,2],[52,4,52,5],[55,0,55,4],[55,5,55,9],[74,0,74,4],[74,5,74,9],[75,0,75,3],[75,5,75,8],[76,0,76,3],[76,5,76,8],[77,0,77,3],[77,5,77,8],[78,0,78,3],[78,5,78,8],[79,0,79,3],[79,5,79,8],[82,0,82,9],[83,0,83,8],[84,0,84,8],[85,0,85,8],[86,0,86,5],[86,6,86,9],[87,0,87,9],[88,1,88,9],[89,1,89,6],[89,8,89,9],[90,0,90,9],[91,1,91,9],[92,1,92,9],[93,1,93,9],[94,0,94,8],[95,0,95,8],[96,0,96,9],[97,0,97,4],[97,5,97,9],[98,0,98,3],[98,5,98,8],[99,0,99,3],[99,5,99,8],[100,0,100,3],[100,5,100,8],[101,0,101,3],[101,5,101,8],[102,0,102,3],[102,5,102,9],[103,0,103,2],[103,3,103,4],[103,5,103,7],[103,8,103,9],[106,1,106,2],[106,4,106,5],[109,0,109,3],[110,0,110,3],[110,4,110,7]]}
["Prover Data Entry",{"$nulls":6},"Report Number:"]
[]
["Customer Information"]
[{"$nulls":7},"Customer ID"]
[{"$nulls":7},"PO#"]
[{"$nulls":7},"POC"]
[{"$nulls":7},"Phone"]
[]
{"$rows_left_out":96}
{"sheet":"Control Data","index":10,"n_rows":4,"n_cols":11,"rows_kept":4}
["Control Chart Information",{"$nulls":9},{"$f":"IF(RptNo=\"\",\"\",\"Report Number: \"&RptNo)","v":""}]
["Note: Copy and Paste to Control Chart"]
["Tech Initials","Date","Test Number",{"$f":"\"Volume (Trial 1) @ 60 ºF\"&IF(NomValUnit=\"Nominal Volume (L)\",\" (L)\",\" (gal)\")","v":"Volume (Trial 1) @ 60 ºF (gal)"},{"$f":"\"Volume (Trial 2) @ 60 ºF\"&IF(NomValUnit=\"Nominal Volume (L)\",\" (L)\",\" (gal)\")","v":"Volume (Trial 2) @ 60 ºF (gal)"},"Start Humidity (% RH)","Finish Humidity (% RH)","Start Air Temp. (ºC)","Finish Air Temp. (ºC)","Water Temp. (Trial 1) (ºC)","Water Temp. (Trial 2) (ºC)"]
[{"$f":"IF('Prover Data Entry'!K21=\"\",\"\",'Prover Data Entry'!K21)","v":""},{"$f":"IF(Cal_Date=\"\",\"\",Cal_Date)","v":""},{"$f":"IF(RptNo=\"\",\"\",RptNo)","v":""},{"$f":"Calculations!E29","v":""},{"$f":"Calculations!E30","v":""},{"$f":"IF(Humidity=\"\",\"\",Humidity)","v":""},{"$f":"IF(Humidity_F=\"\",\"\",Humidity_F)","v":""},{"$f":"IF(AirTemp=\"\",\"\",AirTemp)","v":""},{"$f":"IF(AirTemp_F=\"\",\"\",AirTemp_F)","v":""},{"$f":"IF(ISERROR(t_1+ProverTempCorr),\"\",t_1+ProverTempCorr)","v":""},{"$f":"IF(ISERROR(t_2+ProverTempCorr),\"\",t_2+ProverTempCorr)","v":""}]

{"sheet":"Calculations","index":11,"n_rows":69,"n_cols":10,"rows_kept":69,"merged":[[3,0,3,4],[3,5,3,9],[20,0,20,3],[20,5,20,8],[21,0,21,4],[21,5,21,9],[22,0,22,2],[22,3,22,4],[22,5,22,7],[22,8,22,9],[23,0,23,2],[23,3,23,4],[23,5,23,7],[23,8,23,9],[26,4,26,5],[27,4,27,5],[28,4,28,5],[29,4,29,5],[32,4,32,5],[33,4,33,5],[36,0,36,9],[37,4,37,5],[37,7,38,9],[38,4,38,5],[41,0,41,9],[42,4,42,5],[43,4,43,5],[43,7,43,9],[44,4,44,5],[44,7,44,9],[47,0,47,9],[48,4,48,5],[48,7,49,9],[49,4,49,5],[52,0,52,9],[53,4,53,5],[53,7,55,9],[54,4,54,5],[55,4,55,5],[58,2,58,8],[59,0,59,9],[62,4,62,5],[63,4,63,5],[64,4,64,5],[65,4,65,5],[66,4,66,5],[67,4,67,5],[68,4,68,5]]}
["Calculations",{"$nulls":8},{"$f":"IF(RptNo=\"\",\"\",\"Report Number: \"&RptNo)","v":""}]
[]
["Measurement Trial Calculations"]
["Volume Standard(s) Trial 1",{"$nulls":4},"Volume Standard(s) Trial 2"]
["Drop #","Std. Ref. Temp. (trefS ºF)","Water Temp.\n(ºF)","Water Density (g/cm³)",{"$f":"IF(NomValUnit=\"\",\"Delivered\nVolume\",IF(NomValUnit=\"Nominal Volume (L)\",\"Delivered\nVolume\n(L)\",\"Delivered\nVolume\n(gal)\"))","v":"Delivered\nVolume"},"Drop #","Std. Ref. Temp. (trefS ºF)","Water Temp.\n(ºF)","Water Density (g/cm³)",{"$f":"IF(NomValUnit=\"\",\"Delivered\nVolume\",IF(NomValUnit=\"Nominal Volume (L)\",\"Delivered\nVolume\n(L)\",\"Delivered\nVolume\n(gal)\"))","v":"Delivered\nVolume"}]
[1,{"$f":"IF('Prover Data Entry'!B58=\"\",\"\",VLOOKUP('Prover Data Entry'!B58,Standards_Table_B,5,FALSE))","v":""},{"$f":"IF('Prover Data Entry'!B58=\"\",\"\",('Prover Data Entry'!D58+StdTempCorr)*1.8+32)","v":""},{"$f":"IF('Prover Data Entry'!B58=\"\",\"\",ROUND((999.97495*(1-((('Prover Data Entry'!D58+StdTempCorr)-3.983035)^2*(('Prover Data Entry'!D58+StdTempCorr)+301.797))/(522528.9*(('Prover Data Entry'!D58+StdTempCorr)+69.34881))))/1000+(-4.612+0.106*('Prover Data Entry'!D58+StdTempCorr))/1000000,8))","v":""},{"$f":"IF('Prover Data Entry'!B58=\"\",\"\",IF(NomValUnit=\"Nominal Volume (L)\",D6*(('Prover Data Entry'!C58+('Prover Data Entry'!E58/1000))*(1+(VLOOKUP('Prover Data Entry'!B58,Standards_Table_B,6,FALSE))*(C6-B6))),D6*(('Prover Data Entry'!C58+('Prover Data Entry'!E58/231))*(1+(VLOOKUP('Prover Data Entry'!B58,Standards_Table_B,6,FALSE))*(C6-B6)))))","v":""},1,{"$f":"IF('Prover Data Entry'!G58=\"\",\"\",VLOOKUP('Prover Data Entry'!G58,Standards_Table_B,5,FALSE))","v":""},{"$f":"IF('Prover Data Entry'!G58=\"\",\"\",('Prover Data Entry'!I58+StdTempCorr)*1.8+32)","v":""},{"$f":"IF('Prover Data Entry'!G58=\"\",\"\",ROUND((999.97495*(1-((('Prover Data Entry'!I58+StdTempCorr)-3.983035)^2*(('Prover Data Entry'!I58+StdTempCorr)+301.797))/(522528.9*(('Prover Data Entry'!I58+StdTempCorr)+69.34881))))/1000+(-4.612+0.106*('Prover Data Entry'!I58+StdTempCorr))/1000000,8))","v":""},{"$f":"IF('Prover Data Entry'!G58=\"\",\"\",IF(NomValUnit=\"Nominal Volume (L)\",I6*(('Prover Data Entry'!H58+('Prover Data Entry'!J58/1000))*(1+(VLOOKUP('Prover Data Entry'!G58,Standards_Table_B,6,FALSE))*(H6-G6))),I6*(('Prover Data Entry'!H58+('Prover Data Entry'!J58/231))*(1+(VLOOKUP('Prover Data Entry'!G58,Standards_Table_B,6,FALSE))*(H6-G6)))))","v":""}]
[2,{"$f":"IF('Prover Data Entry'!B59=\"\",\"\",VLOOKUP('Prover Data Entry'!B59,Standards_Table_B,5,FALSE))","v":""},{"$f":"IF('Prover Data Entry'!B59=\"\",\"\",('Prover Data Entry'!D59+StdTempCorr)*1.8+32)","v":""},{"$f":"IF('Prover Data Entry'!B59=\"\",\"\",ROUND((999.97495*(1-((('Prover Data Entry'!D59+StdTempCorr)-3.983035)^2*(('Prover Data Entry'!D59+StdTempCorr)+301.797))/(522528.9*(('Prover Data Entry'!D59+StdTempCorr)+69.34881))))/1000+(-4.612+0.106*('Prover Data Entry'!D59+StdTempCorr))/1000000,8))","v":""},{"$f":"IF('Prover Data Entry'!B59=\"\",\"\",IF(NomValUnit=\"Nominal Volume (L)\",D7*(('Prover Data Entry'!C59+('Prover Data Entry'!E59/1000))*(1+(VLOOKUP('Prover Data Entry'!B59,Standards_Table_B,6,FALSE))*(C7-B7))),D7*(('Prover Data Entry'!C59+('Prover Data Entry'!E59/231))*(1+(VLOOKUP('Prover Data Entry'!B59,Standards_Table_B,6,FALSE))*(C7-B7)))))","v":""},2,{"$f":"IF('Prover Data Entry'!G59=\"\",\"\",VLOOKUP('Prover Data Entry'!G59,Standards_Table_B,5,FALSE))","v":""},{"$f":"IF('Prover Data Entry'!G59=\"\",\"\",('Prover Data Entry'!I59+StdTempCorr)*1.8+32)","v":""},{"$f":"IF('Prover Data Entry'!G59=\"\",\"\",ROUND((999.97495*(1-((('Prover Data Entry'!I59+StdTempCorr)-3.983035)^2*(('Prover Data Entry'!I59+StdTempCorr)+301.797))/(522528.9*(('Prover Data Entry'!I59+StdTempCorr)+69.34881))))/1000+(-4.612+0.106*('Prover Data Entry'!I59+StdTempCorr))/1000000,8))","v":""},{"$f":"IF('Prover Data Entry'!G59=\"\",\"\",IF(NomValUnit=\"Nominal Volume (L)\",I7*(('Prover Data Entry'!H59+('Prover Data Entry'!J59/1000))*(1+(VLOOKUP('Prover Data Entry'!G59,Standards_Table_B,6,FALSE))*(H7-G7))),I7*(('Prover Data Entry'!H59+('Prover Data Entry'!J59/231))*(1+(VLOOKUP('Prover Data Entry'!G59,Standards_Table_B,6,FALSE))*(H7-G7)))))","v":""}]
[3,{"$f":"IF('Prover Data Entry'!B60=\"\",\"\",VLOOKUP('Prover Data Entry'!B60,Standards_Table_B,5,FALSE))","v":""},{"$f":"IF('Prover Data Entry'!B60=\"\",\"\",('Prover Data Entry'!D60+StdTempCorr)*1.8+32)","v":""},{"$f":"IF('Prover Data Entry'!B60=\"\",\"\",ROUND((999.97495*(1-((('Prover Data Entry'!D60+StdTempCorr)-3.983035)^2*(('Prover Data Entry'!D60+StdTempCorr)+301.797))/(522528.9*(('Prover Data Entry'!D60+StdTempCorr)+69.34881))))/1000+(-4.612+0.106*('Prover Data Entry'!D60+StdTempCorr))/1000000,8))","v":""},{"$f":"IF('Prover Data Entry'!B60=\"\",\"\",IF(NomValUnit=\"Nominal Volume (L)\",D8*(('Prover Data Entry'!C60+('Prover Data Entry'!E60/1000))*(1+(VLOOKUP('Prover Data Entry'!B60,Standards_Table_B,6,FALSE))*(C8-B8))),D8*(('Prover Data Entry'!C60+('Prover Data Entry'!E60/231))*(1+(VLOOKUP('Prover Data Entry'!B60,Standards_Table_B,6,FALSE))*(C8-B8)))))","v":""},3,{"$f":"IF('Prover Data Entry'!G60=\"\",\"\",VLOOKUP('Prover Data Entry'!G60,Standards_Table_B,5,FALSE))","v":""},{"$f":"IF('Prover Data Entry'!G60=\"\",\"\",('Prover Data Entry'!I60+StdTempCorr)*1.8+32)","v":""},{"$f":"IF('Prover Data Entry'!G60=\"\",\"\",ROUND((999.97495*(1-((('Prover Data Entry'!I60+StdTempCorr)-3.983035)^2*(('Prover Data Entry'!I60+StdTempCorr)+301.797))/(522528.9*(('Prover Data Entry'!I60+StdTempCorr)+69.34881))))/1000+(-4.612+0.106*('Prover Data Entry'!I60+StdTempCorr))/1000000,8))","v":""},{"$f":"IF('Prover Data Entry'!G60=\"\",\"\",IF(NomValUnit=\"Nominal Volume (L)\",I8*(('Prover Data Entry'!H60+('Prover Data Entry'!J60/1000))*(1+(VLOOKUP('Prover Data Entry'!G60,Standards_Table_B,6,FALSE))*(H8-G8))),I8*(('Prover Data Entry'!H60+('Prover Data Entry'!J60/231))*(1+(VLOOKUP('Prover Data Entry'!G60,Standards_Table_B,6,FALSE))*(H8-G8)))))","v":""}]
{"$rows_left_out":62}
{"sheet":"Pressure Corrections","index":12,"n_rows":41,"n_cols":6,"rows_kept":41,"merged":[[8,2,8,5]]}
["Pressure Corrections",{"$nulls":4},{"$f":"IF(RptNo=\"\",\"\",\"Report Number: \"&RptNo)","v":""}]
[]
["Pressure Correction Formulas"]
["Prover Error at Reference Temperature and Selected Pressure"]
[]
[null,"where"]
[null,"VXtrefX =","Prover volume at reference temperature and 0 psig"]
[null,"VNominal =","Nominal volume of prover"]
{"$rows_left_out":34}
{"sheet":"Water Compressability","index":13,"n_rows":61,"n_cols":5,"rows_kept":61,"merged":[[3,0,3,4],[12,0,12,4],[26,0,26,1],[27,0,27,1],[28,0,28,1],[29,0,29,1],[32,0,32,2],[33,0,33,2],[34,0,34,2],[35,0,35,2],[38,0,38,2]]}
["Compressibility of Water",{"$nulls":3},{"$f":"IF(RptNo=\"\",\"\",\"Report Number: \"&RptNo)","v":""}]
[]
["Compressibility of Water Equations and Calculations"]
["The Thermal Compressibility of Water (kT) equation is from the article by Frank E. Jones and Georgia L. Harris, \"ITS-90 Density of Water Formulation for Volumetric Standards Calibration\", as published in the Journal of Research of the National Institution of Standards and Technology, Vol. 97, No. 3, 1992."]
["kT (kPa)-1 =","50.831 01x10-8 - 3.682 93x10-9t + 7.263 725x10-11t2 - 6.597 702x10-13t3 + 2.877 67x10-15t4"]
["kT (kPa)-1 =",{"$f":"IF(D34=\"\",\"\",0.0000005083101-0.00000000368293*D34+0.00000000007263725*D34^2-0.0000000000006597702*D34^3+2.87767E-15*D34^4)","v":4.6628157738881265E-7}]
[]
["where"]
{"$rows_left_out":54}
{"sheet":"Uncertainty Analysis","index":14,"n_rows":104,"n_cols":12,"rows_kept":104,"merged":[[0,2,0,5],[9,2,9,11],[10,2,10,11],[11,2,11,11],[12,2,12,11],[13,2,13,11],[14,2,14,11],[15,2,15,11],[16,2,16,11],[17,2,17,11],[20,1,20,5],[20,6,20,11],[21,1,21,5],[21,6,21,11],[22,1,22,5],[22,6,22,11],[23,1,23,5],[23,6,23,11],[24,1,24,5],[24,6,24,11],[25,1,25,5],[25,6,25,11],[26,1,26,5],[26,6,26,11],[27,1,27,5],[27,6,27,11],[30,0,30,2],[30,3,30,4],[30,8,30,9],[31,0,31,2],[32,0,32,2],[34,0,34,2],[34,3,34,5],[34,6,34,7],[35,0,35,2],[35,3,35,4],[35,8,35,9],[37,0,37,2],[41,0,41,2],[41,3,41,5],[41,6,41,7],[41,8,41,9],[41,10,41,11],[42,0,42,2],[57,10,57,11],[58,0,58,2],[58,3,58,5],[60,0,60,2],[76,0,76,2],[77,0,77,2],[78,0,78,2],[81,0,81,1],[82,0,82,1],[83,0,83,1],[84,0,84,1],[85,0,85,1],[86,0,86,1],[87,0,87,1],[88,0,88,1],[89,0,89,1],[90,0,90,1],[91,0,91,1],[92,0,92,1]]}
["Uncertainty Analysis",{"$nulls":10},""]
[]
["Specify Procedure"]
["NISTIR 7383, SOP 21, Calibration of LPG Provers"]
[]
["Specify Equation(s)"]
["Volume at the Reference Temperature"]
[]
{"$rows_left_out":97}
{"sheet":"Tables & Lists","index":15,"n_rows":18,"n_cols":4,"rows_kept":18,"merged":[[2,0,2,1]]}
["Tables & Lists",null,null,{"$f":"IF(RptNo=\"\",\"\",\"Report Number: \"&RptNo)","v":""}]
[]
["Cubical Coefficient of Expansion Table\n(CCE_Table) &\nMaterial List\n(Material.List)",null,null," Pick Lists\nfor\nData Validation Cells"]
["Material","cm³/ºF",null,"Scale Graduations (in³)"]
["Steel, Pressure Vessel, Low Carbon",1.6e-05,null,"Scale Graduations (gal)"]
["Steel, Prover, Low Carbon",1.86e-05,null,"Scale Graduations (L)"]
["Steel, Stainless",2.65E-5,null,"Scale Graduations (mL)"]
[]
{"$rows_left_out":10}