{"text_format":"3","workbook":"xlsx","n_sheets":15,"sheets":["Software Technical Assessment","Documentation","SOP 33","Instructions","Report Pages 1-3","Inspection Checklist","Control Data","Data Entry","SOP 4 Observations","SOP 8 Observations","Calculations","SOP 8 Uncertainty Analysis","SOP 4 Uncertainty Analysis","CIPM Air Density","Tables and Lists"],"not_rendered":{"charts":2,"images":6,"external_links":4,"defined_names":159,"comments":1},"read":"whole","date_system":"1900"}

{"sheet":"Software Technical Assessment","index":0,"n_rows":49,"n_cols":4,"rows_kept":49,"merged":[[5,0,17,0],[18,0,21,0],[22,0,25,0],[26,0,28,0],[29,0,34,0],[35,0,38,0],[39,0,40,0],[43,0,48,0],[56,4,56,5]]}
["Software Technical Assessment"]
[]
["Software Description","WAMRF-010 (Rev. 10), Calibration of Weight Carts, SOP 33","Approval Date","2015-12-23"]
["Assessed By","Dan Wright","Approved By","Dan Wright"]
["Codes","Assessment","Pass/Fail","Evidence"]
["A. Software Inspection","Spreadsheet is clear and makes sense","Pass","All worksheet are appropriately named and easy to understand"]
[null,"There are instructions for use ","Pass","Instructions worksheet"]
[null,"Instructions and data input appear on the visible portion of the first worksheet","Pass","The workbook opens to the instruction worksheet"]
[null,"Data-entry fields are labeled and color coded (it is recommended to avoid red and green)","Pass","Light yellow for blank, light blue for non-blank cells"]
[null,"The Standard Operating Procedure (SOP) used is clearly specified","Pass","Specified on Uncertainty Analysis worksheet"]
[null,"The number of digits to be rounded to is specified","Pass","Mass corrections and uncertainties are rounded according to NISTIR 6969, GLP 9"]
[null,"The user is warned/notified whenever data-entry fields are left blank","Pass","In data validation cells only"]
[null,"Data-entry fields are “blank” when opened, preventing loss of old data and ensuring that old data is not used with the current calculations","Pass","Data entry fields on the workbook template are blank. Instructions tell user to break links before saving after a calibration is performed"]
[null,"The software opens at the right location within the file","Pass","Opens to the Instruction worksheet"]
[null,"Unused fields/cells are locked","Pass","Unused cells are locked and worksheets are protected"]
{"$rows_left_out":35}
{"sheet":"Documentation","index":1,"n_rows":41,"n_cols":3,"rows_kept":41}
["Documentation",null,{"$f":"IF(ISBLANK(RptNo),\"\",\"Report Number: \"&RptNo)","v":""}]
["Date","Description","Initials"]
["2012-08-15","This spreadsheet was developed by Dan Wright, WA Dept of Agriculture. This workbook follows the procedure documented in NISTIR 6969, SOP 33.","DAW"]
["2012-08-15","Validated ranges.","DAW"]
["2012-08-15","Validated workbook, file name \"WA2012-08-15 WAMRF-010 (Rev. 03), SOP 33 Workbook V&V.pdf\". Electronic copies in laboratory computer C:\\ drive and agency server H:\\ drive and paper copy in laboratory files.","DAW"]
["2013-02-17","Removed GLP Rounding macros","DAW"]
["2013-02-17","Entered new rounding technique and corrected formulas","DAW"]
["2013-02-17","Validated range names.","DAW"]
["2013-02-17","Validated workbook, file name \"WA2013-02-17 WAMRF-010 (Rev. 04), SOP 33 Workbook V&V.pdf\". Electronic copies in laboratory computer C:\\ drive and agency server H:\\ drive and paper copy in laboratory files.","DAW"]
["2013-07-29","Updated input for and added the Welch-Satterthwaite formula for effective degrees of freedom.","DAW"]
["2013-07-29","Revised all ISBLANK() statements.","DAW"]
["2013-07-29","Modified Uncertainty worksheet","DAW"]
["2013-07-29","Validated range names and spell checked.","DAW"]
["2013-07-29","Validated workbook, file name \"WA2013-07-29 WAMRF-010 (Rev. 05), SOP 33 Workbook V&V.pdf\". Electronic copies in laboratory computer C:\\ drive and agency server H:\\ drive and paper copy in laboratory files.","DAW"]
["2013-08-28","Fixed standard uncertainty formulas in cells D39 & D40 on the Uncertainty Analysis worksheet","DAW"]
{"$rows_left_out":27}
{"sheet":"SOP 33","index":2,"n_rows":0,"n_cols":0,"rows_kept":0}

{"sheet":"Instructions","index":3,"n_rows":125,"n_cols":2,"rows_kept":125,"merged":[[0,0,0,1],[8,0,8,1]]}
["Instructions"]
["No.","Description"]
[1,"Validate this workbook after any changes."]
[2,"The worksheets are password protected. Password is password. You should protect each sheet with your own unique password. Place a password hint here so you don't forget it. Password hint is: \"?\""]
[3,"This workbook has links to the Standards, Customer List, and Mass Tolerances workbooks"]
[4,"Break links after calibration to lock in the data from linked workbooks."]
[5,"The calibration of the standards are treated as dependent in the Data Entry worksheet. If you are using independent calibrated standards you need to change the formula in cell F56 on the Data Entry worksheet to a root sum square calculation. The same for cell F60 for the sensitivity weights."]
[]
["Range Names"]
["Name","Range"]
["Balance","='Data Entry'!$E$16"]
["BalID","='Data Entry'!$C$16"]
["BalUnit","='Data Entry'!$J$16"]
["Best_df","='Data Entry'!$H$19"]
["Best_k","='Data Entry'!$J$19"]
{"$rows_left_out":111}
{"sheet":"Report Pages 1-3","index":4,"n_rows":89,"n_cols":7,"rows_kept":89,"merged":[[32,0,33,6],[37,5,37,6],[40,0,40,1],[40,2,40,6],[41,0,41,6],[56,3,56,4],[57,0,57,1],[57,3,57,4],[58,0,58,1],[58,3,58,4],[61,0,61,6],[63,0,63,6],[65,0,65,6],[69,0,69,2],[69,3,69,4],[69,5,69,6],[70,0,70,2],[70,5,70,6],[71,0,71,6],[75,0,75,6],[76,0,76,6],[77,0,77,6],[78,0,78,6],[79,0,79,6],[80,0,80,6],[83,0,83,6],[84,0,84,6],[85,0,85,6]]}
{"$rows_empty":10}
[{"$nulls":3},"REPORT OF CALIBRATION"]
[]
[{"$nulls":3},"Issued To:"]
[{"$nulls":3},{"$f":"IF('Data Entry'!A4=\"\",\"\",'Data Entry'!A4)","v":""}]
[{"$nulls":3},{"$f":"IF('Data Entry'!A5=\"\",\"\",'Data Entry'!A5)","v":""}]
[{"$nulls":3},{"$f":"IF('Data Entry'!A6=\"\",\"\",'Data Entry'!A6)","v":""}]
[{"$nulls":3},{"$f":"IF('Data Entry'!A7=\"\",\"\",'Data Entry'!A7)","v":""}]
[]
[{"$nulls":3},"Point of Contact:"]
[{"$nulls":3},{"$f":"IF(POC=\"\",\"\",POC)","v":""}]
[{"$nulls":3},{"$f":"IF(POC_Phone=\"\",\"\",\"Ph. \"&POC_Phone)","v":""}]
[]
[{"$nulls":3},"Purchase Order Number:"]
[{"$nulls":3},{"$f":"IF(PO_No=\"\",\"\",PO_No)","v":""}]
{"$rows_left_out":66}
{"sheet":"Inspection Checklist","index":5,"n_rows":33,"n_cols":7,"rows_kept":33,"merged":[[0,0,0,6],[7,0,7,6],[8,0,8,6],[12,0,12,6],[13,0,13,6],[16,0,16,6],[17,0,17,6],[27,0,27,6],[28,0,28,6],[29,0,29,6],[30,0,30,6],[31,0,31,6],[32,0,32,6]]}
["WSDA Weights and Measures Metrology Laboratory"]
[{"$f":"\"Report Number: \"&RptNo","v":"Report Number: "},{"$nulls":5},{"$f":"IF(Cal_Date=\"\",\"Inspection Date:\",\"Inspection Date: \"&TEXT(Cal_Date,\"mmmm d, yyyy\"))","v":"Inspection Date:"}]
["Inspection Checklist for Weight Cart"]
[]
[null,"Manufacturer:",{"$f":"IF(Mfg=\"\",\"\",Mfg)","v":""},null,null,"Date of Manufacture:",{"$f":"IF(Mfg_Date=\"\",\"\",Mfg_Date)","v":""}]
[null,"Model Number:",{"$f":"IF(ID=\"\",\"\",ID)","v":""},null,null,"ID/SN Number:",{"$f":"IF(SN=\"\",\"\",SN)","v":""}]
[null,"Nominal Mass of Weight Cart:",{"$f":"IF(Nx=\"\",\"\",Nx)&\" lb\"","v":" lb"},null,null,"Nominal Mass Suitably Marked:",{"$f":"IF('Data Entry'!I29=\"\",\"\",'Data Entry'!I29)","v":""}]
[]
[]
["Power Source:",{"$f":"IF('Data Entry'!C24=\"\",\"\",'Data Entry'!C24)","v":""},null,null,"Power Source Reference Level:",{"$f":"IF('Data Entry'!H24=\"\",\"\",'Data Entry'!H24)","v":""}]
["Engine Oil:",{"$f":"IF('Data Entry'!C25=\"\",\"\",'Data Entry'!C25)","v":""},null,null,"Engine Oil Reference Mark:",{"$f":"IF('Data Entry'!H25=\"\",\"\",'Data Entry'!H25)","v":""}]
["Hydraulic Oil:",{"$f":"IF('Data Entry'!C26=\"\",\"\",'Data Entry'!C26)","v":""},null,null,"Hydraulic Oil Reference Mark:",{"$f":"IF('Data Entry'!H26=\"\",\"\",'Data Entry'!H26)","v":""}]
[]
[]
["No. of Axles:",{"$f":"IF('Data Entry'!C27=\"\",\"\",'Data Entry'!C27)","v":""},"No. of Tires:",{"$f":"IF('Data Entry'!F27=\"\",\"\",'Data Entry'!F27)","v":""},null,"Sealed  Wheel Bearings?:",{"$f":"IF('Data Entry'!J27=\"\",\"\",'Data Entry'!J27)","v":""}]
{"$rows_left_out":19}
{"sheet":"Control Data","index":6,"n_rows":3,"n_cols":12,"rows_kept":3}
["Control Chart Information",{"$nulls":10},{"$f":"IF(RptNo=\"\",\"\",\"Report Number: \"&RptNo)","v":""}]
["Technician Initials","Date","Report Number",{"$f":"\" Cx vs 8.0 (MAX)\n(g)\"","v":" Cx vs 8.0 (MAX)\n(g)"},{"$f":"\"Cx vs 8.0 (MIN)\n(g)\"","v":"Cx vs 8.0 (MIN)\n(g)"},"Balance ID","Start Air Temperature (ºC)","Finish Air Temperature (ºC)","Start Pressure (g/cm³)","Finish Pressure (g/cm³)","Start Humidity\n(% RH)","Finish Humidity\n(% RH)"]
[{"$f":"IF(Tech_Int=\"\",\"\",Tech_Int)","v":""},{"$f":"IF(Cal_Date=\"\",\"\",Cal_Date)","v":""},{"$f":"IF(RptNo=\"\",\"\",RptNo&\" AF\")","v":""},{"$f":"IF(Nx=\"\",\"\",(MAX(Calculations!H5:I7)-Nx)*453.59237)","v":""},{"$f":"IF(Nx=\"\",\"\",(MIN(Calculations!H5:I7)-Nx)*453.59237)","v":""},{"$f":"IF(BalID=\"\",\"\",BalID)","v":""},{"$f":"IF(SOP4_t1=\"\",\"\",SOP4_t1)","v":""},{"$f":"IF(SOP4_t2=\"\",\"\",SOP4_t2)","v":""},{"$f":"IF(SOP4_P1=\"\",\"\",SOP4_P1)","v":""},{"$f":"IF(SOP4_P2=\"\",\"\",SOP4_P2)","v":""},{"$f":"IF(SOP4_U1=\"\",\"\",SOP4_U1)","v":""},{"$f":"IF(SOP4_U2=\"\",\"\",SOP4_U2)","v":""}]

{"sheet":"Data Entry","index":7,"n_rows":66,"n_cols":10,"rows_kept":66,"merged":[[0,7,0,9],[3,0,3,5],[3,6,3,8],[4,0,4,5],[4,7,4,9],[5,0,5,5],[5,7,5,9],[6,0,6,5],[6,7,6,9],[9,0,9,1],[9,2,9,4],[9,5,9,7],[9,8,9,9],[10,0,10,1],[10,2,10,4],[10,5,10,7],[10,8,10,9],[11,0,11,1],[11,2,11,4],[11,5,11,7],[11,8,11,9],[12,0,12,1],[12,2,12,4],[12,5,12,7],[12,8,12,9],[13,0,13,1],[13,2,13,4],[13,5,13,7],[13,8,13,9],[14,0,14,1],[14,2,14,4],[14,5,14,7],[14,8,14,9],[15,0,15,1],[15,4,15,5],[16,0,16,4],[16,5,16,6],[16,7,16,8],[17,0,17,6],[17,7,17,9],[18,0,18,3],[18,4,18,5],[19,0,19,4],[19,6,19,8],[20,0,20,1],[20,2,20,3],[20,5,20,7],[23,0,23,1],[23,2,23,3],[23,4,23,6],[23,7,23,9],[24,0,24,1],[24,2,24,3],[24,4,24,6],[24,7,24,9],[25,0,25,1],[25,2,25,3],[25,4,25,6],[25,7,25,9],[26,0,26,1],[26,3,26,4],[26,6,26,8],[27,2,27,3],[27,5,27,6],[27,8,27,9],[28,0,28,7],[28,8,28,9],[29,0,29,7],[29,8,29,9],[30,0,30,7],[30,8,30,9],[31,0,31,7],[31,8,31,9],[32,0,32,1],[32,6,32,8],[33,0,33,7],[33,8,33,9],[34,0,34,7],[34,8,34,9],[35,0,35,7],[35,8,35,9],[36,0,36,9],[37,0,37,9],[38,0,38,9],[39,0,39,9],[42,0,42,8],[43,0,43,2],[43,3,43,4],[43,5,43,6],[44,0,44,2],[44,3,44,4],[44,5,44,6],[45,0,45,2],[45,3,45,4],[45,5,45,6],[49,1,49,2],[49,3,49,4],[49,5,49,6],[50,1,50,2],[50,3,50,4],[50,5,50,6],[51,1,51,2],[51,3,51,4],[51,5,51,6],[52,1,52,2],[52,3,52,4],[52,5,52,6],[53,1,53,2],[53,3,53,4],[53,5,53,6],[54,1,54,2],[54,3,54,4],[54,5,54,6],[55,1,55,2],[55,3,55,4],[55,5,55,6],[57,1,57,2],[57,3,57,4],[57,5,57,6],[58,1,58,2],[58,3,58,4],[58,5,58,6],[59,1,59,2],[59,3,59,4],[59,5,59,6],[62,0,62,1],[62,3,62,4],[62,5,62,6],[63,0,63,1],[63,3,63,4],[63,5,63,6],[64,0,64,1],[64,3,64,4],[64,5,64,6],[65,0,65,1],[65,3,65,4],[65,5,65,6]]}
["Data Entry",{"$nulls":5},"Report Number:"]
[]
["Customer Information"]
[{"$nulls":6},"Customer ID"]
[{"$nulls":6},"PO#"]
[{"$nulls":6},"POC"]
[{"$nulls":6},"Phone"]
[]
["Calibration Item & Measurement Information"]
["Item Description",null,"Weight Cart",null,null,"Date Received"]
["Manufacture",{"$nulls":4},"Weight Cart Manufacture Date"]
["Serial Number",{"$nulls":4},"Job Order Number"]
["ID/Model Number",{"$nulls":4},"Nominal Value (avdp. pound)"]
["Artifact Condition",null,"See Inspection Checklist",null,null,"Assumed Density (g/cm³)"]
["Tol. Specification",null,"NIST HB 105-8",null,null,"Tolerance (± lb)",null,null,{"$f":"IF(Nx=\"\",\"\",VLOOKUP(Nx,Tol,2))","v":""}]
{"$rows_left_out":52}
{"sheet":"SOP 4 Observations","index":8,"n_rows":38,"n_cols":10,"rows_kept":38,"merged":[[2,0,2,9],[3,0,3,9],[4,3,4,4],[4,6,5,9],[5,3,5,4],[6,0,6,2],[6,3,6,4],[6,6,6,9],[9,0,10,2],[9,3,10,5],[9,6,10,8],[9,9,10,9],[11,0,11,2],[11,3,11,5],[11,6,11,8],[11,9,14,9],[12,0,12,2],[12,3,12,5],[12,6,12,8],[13,0,13,2],[13,3,13,5],[13,6,13,8],[14,0,14,2],[14,3,14,5],[14,6,14,8],[16,0,16,5],[16,6,16,8],[17,0,17,9],[18,0,18,7],[18,8,18,9],[21,0,21,1],[21,9,22,9],[22,0,22,2],[22,3,22,5],[22,6,22,8],[23,0,23,2],[23,3,23,5],[23,6,23,8],[23,9,26,9],[24,0,24,2],[24,3,24,5],[24,6,24,8],[25,0,25,2],[25,3,25,5],[25,6,25,8],[26,0,26,2],[26,3,26,5],[26,6,26,8],[27,0,27,9],[28,0,28,2],[28,3,28,5],[28,6,28,8],[28,9,31,9],[29,0,29,2],[29,3,29,5],[29,6,29,8],[30,0,30,2],[30,3,30,5],[30,6,30,8],[31,0,31,2],[31,3,31,5],[31,6,31,8],[32,0,32,9],[33,0,33,2],[33,3,33,5],[33,6,33,8],[33,9,36,9],[34,0,34,2],[34,3,34,5],[34,6,34,8],[35,0,35,2],[35,3,35,5],[35,6,35,8],[36,0,36,2],[36,3,36,5],[36,6,36,8],[37,0,37,1],[38,0,38,9]]}
["SOP 4 Observations",{"$nulls":8},{"$f":"IF(RptNo=\"\",\"\",\"Report Number: \"&RptNo)","v":""}]
[]
["Uncertainty Evaluation"]
["Criteria: NIST HB 143, Table 4, \"The expanded uncertainty\n must be less than 1/3 of the maximum permissible error.\""]
[null,null,{"$f":"\"1/3 \"&Tol_Class&\" Tolerence =\"","v":"1/3 NIST HB 105-8 Tolerence ="},{"$f":"IF(Tolerance=\"\",\"\",Tolerance/3)","v":""},null,"lb",{"$f":"IF(D6=\"\",\"\",IF(D6<D5,\"The Uncertainty Meets the Criteria, Report Findings.\",\"The Uncertainty Does Not Meet the Criteria!\"))","v":""}]
[null,null,"Expanded Uncertainty =",{"$f":"IF(Final_U_SOP4=\"\",\"\",Final_U_SOP4/453.59237)","v":""},null,"lb"]
["Precision Test (Pn) =",null,null,{"$f":"IF(D5=\"\",\"\",D6/D5)","v":""},null,null,{"$f":"IF(D5=\"\",\"\",IF(D7<0.8,\"Precision Test is less than 1, Passed\",IF(AND(D7>=0.8,D7<1),\"Precision Test is less than 1, Passed but high\",IF(D7>1,\"Precision Test is greater than 1, Failed\"))))","v":""}]
[]
["Initial Observations and Mass Adjustment"]
["Observation Number",null,null,"Weights",null,null,{"$f":"\"Balance Readings (\"&IF(BalUnit=\"\",\"\",BalUnit)&\")\"","v":"Balance Readings ()"},null,null,"SOP 4, 2.5.2.5 Check"]
[]
["O1",null,null,{"$f":"IF(Procedure=\"SOP 4 - Option A (SXXS)\",\"S\",\"X\")","v":"X"},{"$nulls":5},{"$f":"IF(SOP4InitObs_4=\"\",\"\",IF(AND(BalUnit=\"lb\",ABS((SOP4InitObs_2-SOP4InitObs_1)-(SOP4InitObs_3-SOP4InitObs_4))*453.59237<MAX(2*sp,10*Resolution)),\"GO\",IF(AND(BalUnit=\"g\",ABS((SOP4InitObs_2-SOP4InitObs_1)-(SOP4InitObs_3-SOP4InitObs_4))<MAX(2*sp,10*Resolution)),\"GO\",\"REPEAT\")))","v":""}]
["O2",null,null,{"$f":"IF(Procedure=\"SOP 4 - Option A (SXXS)\",\"X\",\"S\")","v":"S"}]
["O3",null,null,{"$f":"IF(Procedure=\"SOP 4 - Option A (SXXS)\",\"X + sw\",\"S + sw\")","v":"S + sw"}]
["O4",null,null,{"$f":"IF(Procedure=\"SOP 4 - Option A (SXXS)\",\"S + sw\",\"X + sw\")","v":"X + sw"}]
{"$rows_left_out":24}
{"sheet":"SOP 8 Observations","index":9,"n_rows":34,"n_cols":10,"rows_kept":34,"merged":[[2,0,2,9],[3,0,3,9],[4,3,4,4],[4,6,5,9],[5,3,5,4],[6,0,6,2],[6,3,6,4],[6,6,6,9],[9,0,10,2],[9,3,10,5],[9,6,10,8],[9,9,11,9],[11,0,11,2],[11,3,11,5],[11,6,11,8],[12,0,12,2],[12,3,12,5],[12,6,12,8],[13,0,13,2],[13,3,13,5],[13,6,13,8],[13,9,14,9],[14,0,14,2],[14,3,14,5],[14,6,14,8],[15,0,15,2],[15,3,15,5],[15,6,15,8],[17,0,17,5],[17,6,17,8],[18,0,18,9],[19,0,19,7],[19,8,19,9],[22,0,22,1],[22,9,24,9],[23,0,23,2],[23,3,23,5],[23,6,23,8],[24,0,24,2],[24,3,24,5],[24,6,24,8],[25,0,25,2],[25,3,25,5],[25,6,25,8],[26,0,26,2],[26,3,26,5],[26,6,26,8],[26,9,29,9],[27,0,27,2],[27,3,27,5],[27,6,27,8],[28,0,28,8],[29,0,29,2],[29,3,29,5],[29,6,29,8],[30,0,30,8],[30,9,31,9],[31,0,31,2],[31,3,31,5],[31,6,31,8],[32,0,32,2],[32,3,32,5],[32,6,32,8],[33,0,33,1],[34,0,34,9]]}
["SOP 8 Observations",{"$nulls":8},""]
[]
["Uncertainty Evaluation"]
["Criteria: NIST HB 143, Table 4, \"The expanded uncertainty\n must be less than 1/3 of the maximum permissible error.\""]
[null,null,"1/3 NIST HB 105-8 Tolerence =",{"$f":"IF(Tolerance=\"\",\"\",Tolerance/3)","v":""},null,"lb",{"$f":"IF(D6=\"\",\"\",IF(D6<D5,\"The Uncertainty Meets the Criteria, Report Findings.\",\"The Uncertainty Does Not Meet the Criteria!\"))","v":""}]
[null,null,"Expanded Uncertainty =",{"$f":"IF(Final_U_SOP8=\"\",\"\",Final_U_SOP8/453.59237)","v":""},null,"lb"]
["Precision Test (Pn) =",null,null,{"$f":"IF(D5=\"\",\"\",D6/D5)","v":""},null,null,{"$f":"IF(D5=\"\",\"\",IF(D7<0.8,\"Precision Test is less than 1, Passed\",IF(AND(D7>=0.8,D7<1),\"Precision Test is less than 1, Passed but high\",IF(D7>1,\"Precision Test is greater than 1, Failed\"))))","v":""}]
[]
["Initial Observations and Mass Adjustment"]
["Observation Number",null,null,"Weights",null,null,"Balance Readings (g)",null,null,"SOP 8 Sensitivity Check"]
[]
["O1",null,null,"S"]
["O2",null,null,"S + sw",{"$nulls":5},{"$f":"IF(G13=\"\",\"\",IF(BalUnit=\"lb\",IF(ABS((sw+Csw)/((G13-G12)*453.59237)-1)*100<=2,\"GO\",\"REPEAT\"),IF(ABS((sw+Csw)/(G13-G12)-1)*100<=2,\"GO\",\"REPEAT\")))","v":""}]
["O3",null,null,"S",{"$nulls":5},"SOP 8 Drift Check"]
["O4",null,null,"X"]
{"$rows_left_out":20}
{"sheet":"Calculations","index":10,"n_rows":33,"n_cols":10,"rows_kept":33,"merged":[[3,0,3,9],[4,7,4,8],[5,7,5,8],[6,7,6,8],[8,7,8,8],[9,7,9,8],[12,0,12,9],[15,5,15,9],[18,0,18,9],[21,5,21,9],[24,0,24,9],[25,4,25,5],[26,4,26,5],[27,4,27,5],[28,4,28,5],[29,4,29,5],[30,4,30,5],[31,4,31,5],[32,4,32,5]]}
["Calculations",{"$nulls":8},{"$f":"IF(RptNo=\"\",\"\",\"Report Number: \"&RptNo)","v":""}]
[]
["Measurement Determinations"]
[{"$f":"\"Measurement Observations Procedure - \"&Procedure","v":"Measurement Observations Procedure - "}]
[{"$nulls":6},"Measurement 1 - Weight Cart Conventional Mass, CM vs 8.0 g/cm³ =",{"$f":"IF(Procedure=\"\",\"\",IF(AND(Procedure=\"SOP 8\",BalUnit=\"lb\"),(S+Cs)/453.59237+(SOP8_O4-SOP8_O3),IF(AND(Procedure=\"SOP 8\",BalUnit=\"g\"),((S+Cs)+(SOP8_O4-SOP8_O3))/453.59237,IF(Procedure=\"SOP 4 - Option A (SXXS)\",((S+Cs+(SOP4DubSub1_O2-SOP4DubSub1_O1+SOP4DubSub1_O3-SOP4DubSub1_O4)/2*((sw+Csw)/(SOP4DubSub1_O3-SOP4DubSub1_O2))+S-(Nx*453.59237))/453.59237),((S+Cs+(SOP4DubSub1_O1-SOP4DubSub1_O2+SOP4DubSub1_O4-SOP4DubSub1_O3)/2*((sw+Csw)/(SOP4DubSub1_O3-SOP4DubSub1_O2))+S-(Nx*453.59237))/453.59237)))))","v":""},null,"lb"]
[{"$nulls":6},"Measurement 2 - Weight Cart Conventional Mass, CM vs 8.0 g/cm³ =",{"$f":"IF(Procedure=\"\",\"\",IF(AND(Procedure=\"SOP 8\",BalUnit=\"lb\"),(S+Cs)/453.59237+(SOP8_O5-SOP8_O3),IF(AND(Procedure=\"SOP 8\",BalUnit=\"g\"),((S+Cs)+(SOP8_O5-SOP8_O3))/453.59237,IF(Procedure=\"SOP 4 - Option A (SXXS)\",((S+Cs+(SOP4DubSub2_O2-SOP4DubSub2_O1+SOP4DubSub2_O3-SOP4DubSub2_O4)/2*((sw+Csw)/(SOP4DubSub2_O3-SOP4DubSub2_O2))+S-(Nx*453.59237))/453.59237),((S+Cs+(SOP4DubSub2_O1-SOP4DubSub2_O2+SOP4DubSub2_O4-SOP4DubSub2_O3)/2*((sw+Csw)/(SOP4DubSub2_O3-SOP4DubSub2_O2))+S-(Nx*453.59237))/453.59237)))))","v":""},null,"lb"]
[{"$nulls":6},"Measurement 3 - Weight Cart Conventional Mass, CM vs 8.0 g/cm³ =",{"$f":"IF(Procedure=\"\",\"\",IF(AND(Procedure=\"SOP 8\",BalUnit=\"lb\"),(S+Cs)/453.59237+(SOP8_O6-SOP8_O3),IF(AND(Procedure=\"SOP 8\",BalUnit=\"g\"),((S+Cs)+(SOP8_O6-SOP8_O3))/453.59237,IF(Procedure=\"SOP 4 - Option A (SXXS)\",((S+Cs+(SOP4DubSub3_O2-SOP4DubSub3_O1+SOP4DubSub3_O3-SOP4DubSub3_O4)/2*((sw+Csw)/(SOP4DubSub3_O3-SOP4DubSub3_O2))+S-(Nx*453.59237))/453.59237),((S+Cs+(SOP4DubSub3_O1-SOP4DubSub3_O2+SOP4DubSub3_O4-SOP4DubSub3_O3)/2*((sw+Csw)/(SOP4DubSub3_O3-SOP4DubSub3_O2))+S-(Nx*453.59237))/453.59237)))))","v":""},null,"lb"]
[]
[{"$nulls":6},"Average Weight Cart Conventional Mass, CMx vs 8.0 g/cm³ = ",{"$f":"IF(H7=\"\",\"\",AVERAGE(H5:I7))","v":""},null,"lb"]
[{"$nulls":6},"Weight Cart Conventional Mass Correction, Cx vs 8.0 g/cm³ = ",{"$f":"IF(CMx=\"\",\"\",H9-Nx)","v":""},null,"lb"]
[]
["Tolerance Compliance Evaluation"]
["Criteria: The conventional mass shall not differ more than the maximum permissible error minus the\nexpanded uncertainty from the nominal value of weight. (ASTM E 617, NIST HB 105-1 & OIML R 111)"]
[null,null,{"$f":"Tol_Class&\" Tolerence (\"&CHAR(177)&\") =\"","v":"NIST HB 105-8 Tolerence (±) ="},{"$f":"IF(Tolerance=\"\",\"\",Tolerance)","v":""},"lb"]
[null,null,{"$f":"\"Expanded Uncertainty (\"&CHAR(177)&\") =\"","v":"Expanded Uncertainty (±) ="},{"$f":"IF(Final_U_SOP4=\"\",\"\",Final_U_SOP4/453.59237)","v":""},"lb"]
{"$rows_left_out":19}
{"sheet":"SOP 8 Uncertainty Analysis","index":11,"n_rows":58,"n_cols":10,"rows_kept":58,"merged":[[0,2,0,3],[24,0,24,9],[27,0,27,9],[31,1,31,4],[31,5,31,8],[32,1,32,4],[32,5,32,9],[33,1,33,4],[33,5,33,9],[34,1,34,4],[34,5,34,9],[35,1,35,4],[35,5,35,9],[36,1,36,4],[36,5,36,9],[39,0,39,1],[40,0,40,1],[41,0,41,1],[42,0,42,1],[43,0,43,1],[44,0,44,1],[45,0,45,1]]}
["Uncertainty Analysis",{"$nulls":8},""]
[]
["Specify Procedure"]
["NISTIR 6969, SOP 33, Calibration of Weight Carts using SOP 8 (Modified for triple modified substitution measurements)"]
[]
["Specify Equation(s)"]
["Modified Substitution"]
["Cx = Cs + ( Xn – O1 ) + Ns – Nx"]
["where"]
["Cs =","the conventional mass correction of the standard weight"]
["Cx =","the conventional mass correction of the weight calibrated"]
["CM =","the conventional mass of a specific weight.  Subscripts s, x, t, sw are used to identify the weight."]
["sw =","small calibrated weight used to evaluate the sensitivity of the balance"]
[]
[]
{"$rows_left_out":44}
{"sheet":"SOP 4 Uncertainty Analysis","index":12,"n_rows":53,"n_cols":10,"rows_kept":53,"merged":[[0,2,0,3],[30,1,30,4],[30,5,30,9],[31,1,31,4],[31,5,31,9],[32,1,32,4],[32,5,32,9],[33,1,33,4],[33,5,33,9],[36,0,36,1],[37,0,37,1],[38,0,38,1],[39,0,39,1],[40,0,40,1]]}
["Uncertainty Analysis",{"$nulls":8},{"$f":"IF(RptNo=\"\",\"\",\"Report Number: \"&RptNo)","v":""}]
[]
["Specify Procedure"]
["NISTIR 6969, SOP 33, Calibration of Weight Carts using SOP 4 (Modified for triple double substitution measurements)"]
[]
["Specify Equation(s)"]
["Double Substitution Optional Sequence B (XSSX) w/o Air Buoyancy Correction"]
[]
["where"]
["S =","standard weight"]
["X =","weight calibrated"]
["t =","small calibrated tare weight, A subscript s or x is used to indicate the larger weight with which it is associated"]
["sw =","small calibrated weight used to evaluate the sensitivity of the balance"]
["N =","the nominal value of a specific weight.  Subscripts s, x, are used to identify the weight."]
["C =","the correction for a specific weight.  Subscripts s, x, are used to identify the weight."]
{"$rows_left_out":39}
{"sheet":"CIPM Air Density","index":13,"n_rows":7,"n_cols":5,"rows_kept":7,"merged":[[1,0,1,4],[2,0,2,4],[3,0,3,2],[3,3,3,4],[4,0,4,2],[4,3,4,4],[5,0,5,2],[5,3,5,4],[6,0,6,2],[6,3,6,4]]}
["CIPM Air Density",{"$nulls":3},{"$f":"IF(RptNo=\"\",\"\",\"Report Number: \"&RptNo)","v":""}]
["Air Density, SOP 2, Option B, 2012 (CIPM 2007)"]
["Air Density\nNote: Air density results are rounded to 9 digits (g/cm³) and used for MABC calculation."]
[" Barometric Pressure (mm Hg)",null,null,{"$f":"IF(AND(SOP4_P1=\"\",SOP8_P1=\"\"),\"\",IF(Procedure=\"SOP 8\",AVERAGE(SOP8_P1+P_corr,SOP8_P2+P_corr),AVERAGE(SOP4_P1+P_corr,SOP4_P2+P_corr)))","v":""}]
[" Temperature (ºC)",null,null,{"$f":"IF(AND(SOP4_t1=\"\",SOP8_t1=\"\"),\"\",IF(Procedure=\"SOP 8\",AVERAGE(SOP8_t1+t_corr,SOP8_t2+t_corr),AVERAGE(SOP4_t1+t_corr,SOP4_t2+t_corr)))","v":""}]
[" Relative Humidity (%)",null,null,{"$f":"IF(AND(SOP4_U1=\"\",SOP8_U1=\"\"),\"\",IF(Procedure=\"SOP 8\",AVERAGE(SOP8_U1+U_corr,SOP8_U2+U_corr),AVERAGE(SOP4_U1+U_corr,SOP4_U2+U_corr)))","v":""}]
[" Calculated Air Density (mg/cm³)",null,null,{"$f":"IF(D6=\"\",0.0012,ROUND(((((D4*(133.322368421053))*(0.02896546))/((1-(((D4*133.322368421053)/(D5+273.15))*((0.00000158123)+((-0.000000029331)*(D5))+(0.00000000011043*D5^2)+(((0.000005707)+(-0.00000002051*D5))*((D6/100)*((1.00062+0.0000000314*(D4*133.322368421053)+0.00000056*D5^2)*((EXP(0.000012378847*(D5+273.15)^2+(-0.019121316*(D5+273.15))+33.93711047+(-6343.1645/(D5+273.15))))/(D4*133.322368421053)))))+((0.00019898+(-0.000002376*D5))*(((D6/100)*((1.00062+0.0000000314*(D4*133.322368421053)+0.00000056*D5^2)*((EXP(0.000012378847*(D5+273.15)^2+(-0.019121316)*(D5+273.15)+33.93711047+(-6343.1645)/(D5+273.15)))/(D4*133.322368421053))))^2))))+(((D4*133.322368421053)^2/((D5+273.15)^2)*(0.0000000000183+(-0.00000000765*(((D6/100)*((1.00062+0.0000000314*(D4*133.322368421053)+0.00000056*D5^2)*((EXP(0.000012378847*(D5+273.15)^2+(-0.019121316)*(D5+273.15)+33.93711047+(-6343.1645)/(D5+273.15)))/(D4*133.322368421053))))^2))))))*(8.314472)*(D5+273.15)))*(1-((0.378*((D6/100)*((1.00062+0.0000000314*(D4*133.322368421053)+0.00000056*D5^2)*((EXP(0.000012378847*(D5+273.15)^2+(-0.019121316)*(D5+273.15)+33.93711047+(-6343.1645)/(D5+273.15)))/(D4*133.322368421053))))))))/1000,9))","v":0.0012}]

{"sheet":"Tables and Lists","index":14,"n_rows":8,"n_cols":2,"rows_kept":8,"merged":[[2,0,2,1]]}
["Tables & Lists"]
[{"$f":"IF(RptNo=\"\",\"\",\"Report Number: \"&RptNo)","v":""}]
["Tolerance Lookup Table\n(Tol)\n(lb)"]
[2000,0.5]
[3000,1]
[4000,1.25]
[5000,1.5]
[6000,2]