{"text_format":"3","workbook":"xlsx","n_sheets":13,"sheets":["Software Technical Assessment","Documentation","SOP 4","OIML Unc Estimates","Instructions","Report Pages 1-3","Report Page 4","Data Entry","Control Data","Calculations","Uncertainty Analysis","CIPM Air Density","Tables and Lists"],"not_rendered":{"charts":1,"images":19,"external_links":4,"defined_names":197,"comments":2},"read":"whole","date_system":"1900"}

{"sheet":"Software Technical Assessment","index":0,"n_rows":49,"n_cols":4,"rows_kept":49,"merged":[[5,0,17,0],[18,0,21,0],[22,0,25,0],[26,0,28,0],[29,0,34,0],[35,0,38,0],[39,0,40,0],[43,0,48,0],[56,4,56,5]]}
["Software Technical Assessment"]
[]
["Software Description","WAMRF-008 (Rev. 24), Weighing by Double Substitution, SOP 4","Approval Date","2015-12-23"]
["Assessed By","Dan Wright","Approved By","Dan Wright"]
["Codes","Assessment","Pass/Fail","Evidence"]
["A. Software Inspection","Spreadsheet is clear and makes sense","Pass","All worksheet are appropriately named and easy to understand"]
[null,"There are instructions for use ","Pass","Instructions worksheet"]
[null,"Instructions and data input appear on the visible portion of the first worksheet","Pass","The workbook opens to the instruction worksheet"]
{"$rows_left_out":42}
{"sheet":"Documentation","index":1,"n_rows":107,"n_cols":3,"rows_kept":107}
["Documentation",null,{"$f":"IF(ISBLANK(RptNo),\"\",\"Report Number: \"&RptNo)","v":""}]
["Date","Description","Initials"]
["2002-10-04","This spreadsheet was developed by Dan Wright, WA Dept of Agriculture. This workbook follows the procedure documented in NISTIR 6969, SOP 4.","DAW"]
["2004-09-29","Changed uncertainty analysis","DAW"]
["2006-10-06","Total revision and reissue","DAW"]
["2007-07-20","Changed check standard test to include control chart bias/drift","DAW"]
["2007-09-24","Rounded air density formula to 6 places and water density to 8 places","DAW"]
["2008-02-04","Deleted 'Standards' worksheet. Re-referenced vlookups to global standards workbooks","DAW"]
{"$rows_left_out":100}
{"sheet":"SOP 4","index":2,"n_rows":0,"n_cols":0,"rows_kept":0}

{"sheet":"OIML Unc Estimates","index":3,"n_rows":0,"n_cols":0,"rows_kept":0}

{"sheet":"Instructions","index":4,"n_rows":167,"n_cols":2,"rows_kept":167,"merged":[[0,0,0,1],[8,0,8,1]]}
["Instructions"]
["No.","Description"]
[1,"Validate this workbook after any changes."]
[2,"The worksheets are password protected: password"]
[3,"The Check nominal value needs to be the same as the Standard nominal."]
[4,"Update Report worksheets with your laboratory information."]
[5,"Update all worksheet headers and the Report pages footers with your unique form numbers to make it part of your document system."]
[6,"Be sure to document all your changes on the Document worksheet."]
{"$rows_left_out":160}
{"sheet":"Report Pages 1-3","index":5,"n_rows":95,"n_cols":7,"rows_kept":95,"merged":[[32,0,33,6],[37,5,37,6],[40,0,40,1],[40,2,40,6],[41,0,41,6],[56,3,56,4],[57,0,57,1],[57,3,57,4],[58,0,58,1],[58,3,58,4],[59,0,59,1],[59,3,59,4],[60,0,60,1],[60,3,60,4],[61,0,61,1],[61,3,61,4],[62,0,62,1],[62,3,62,4],[65,0,65,6],[68,0,68,6],[71,0,71,6],[72,0,72,6],[76,0,76,6],[77,0,77,6],[78,0,78,6],[79,0,79,6],[80,0,80,6],[86,0,86,2],[86,3,86,4],[86,5,86,6],[87,0,87,2],[87,3,87,4],[87,5,87,6],[89,0,89,2],[89,5,89,6],[93,0,93,2],[93,5,93,6],[94,0,94,2],[94,5,94,6]]}
{"$rows_empty":10}
[{"$nulls":3},"REPORT OF CALIBRATION"]
[]
[{"$nulls":3},"Issued To:"]
[{"$nulls":3},{"$f":"IF('Data Entry'!A4=\"\",\"\",'Data Entry'!A4)","v":""}]
[{"$nulls":3},{"$f":"IF('Data Entry'!A5=\"\",\"\",'Data Entry'!A5)","v":""}]
[{"$nulls":3},{"$f":"IF('Data Entry'!A6=\"\",\"\",'Data Entry'!A6)","v":""}]
[{"$nulls":3},{"$f":"IF('Data Entry'!A7=\"\",\"\",'Data Entry'!A7)","v":""}]
{"$rows_left_out":79}
{"sheet":"Report Page 4","index":6,"n_rows":9,"n_cols":11,"rows_kept":9,"merged":[[0,0,0,10]]}
["WSDA Weights and Measures Metrology Laboratory"]
[{"$f":"\"Report Number: \"&RptNo","v":"Report Number: "},{"$nulls":9},{"$f":"IF(Cal_Date=\"\",\"Calibration Date:\",\"Calibration Date: \"&TEXT(Cal_Date,\"mmmm d, yyyy\"))","v":"Calibration Date:"}]
[{"$f":"IF(Obs3_1=\"\",\"As Found / Left Calibration Results\",\"As Found Calibration Results\")","v":"As Found / Left Calibration Results"}]
["Nominal Mass","ID",{"$f":"IF(Nx=\"\",\"True Mass Correction\",IF(Rpt_Units=\"Nominal Value\",\"True Mass Correction (\"&Calculations!D55&\")\",\"True Mass Correction (\"&Calculations!D70&\")\"))","v":"True Mass Correction"},{"$f":"IF(Nx=\"\",\"Conventional Mass Correction\",IF(Rpt_Units=\"Nominal Value\",\"Conventional Mass Correction (\"&Calculations!D57&\")\",\"Conventional Mass Correction (\"&Calculations!D72&\")\"))","v":"Conventional Mass Correction"},{"$f":"IF(Nx=\"\",\"Uncertainty\",IF(Rpt_Units=\"Nominal Value\",\"Uncertainty ± (\"&Calculations!D61&\")\",\"Uncertainty ± (\"&Calculations!D76&\")\"))","v":"Uncertainty"},"k-factor","Degrees of Freedom",{"$f":"IF(Nx=\"\",\"MPE\",IF(Rpt_Units=\"Nominal Value\",Class_Spec&\" MPE ± (\"&Calculations!D62&\")\",Class_Spec&\" MPE ± (\"&Calculations!D77&\")\"))","v":"MPE"},"Assumed Density (g/cm³)","Uncertainty of Assumed Density (g/cm³)","Air Density (g/cm³)"]
[{"$f":"IF(Nx=\"\",\"\",Nx&\" \"&VLOOKUP(Xnom,ConvTable,9,FALSE))","v":""},null,{"$f":"IF(Nx=\"\",\"\",IF(Rpt_Units=\"Nominal Value\",Calculations!C55,Calculations!C70))","v":""},{"$f":"IF(Nx=\"\",\"\",IF(Rpt_Units=\"Nominal Value\",Calculations!C57,Calculations!C72))","v":""},{"$f":"IF(Nx=\"\",\"\",IF(Rpt_Units=\"Nominal Value\",Calculations!C61,Calculations!C76))","v":""},{"$f":"IF(Nx=\"\",\"\",Final_k)","v":""},{"$f":"IF(Nx=\"\",\"\",Final_Veff)","v":""},{"$f":"IF(Nx=\"\",\"\",IF(Rpt_Units=\"Nominal Value\",Calculations!C62,Calculations!C77))","v":""},{"$f":"IF(Nx=\"\",\"\",Px)","v":""},{"$f":"IF(Nx=\"\",\"\",uPt)","v":""},{"$f":"IF(Nx=\"\",\"\",Pa)","v":""}]
[]
["As Left Calibration Results"]
["Nominal Mass","ID",{"$f":"IF(Nx=\"\",\"True Mass Correction\",IF(Rpt_Units=\"Nominal Value\",\"True Mass Correction (\"&Calculations!D56&\")\",\"True Mass Correction (\"&Calculations!D71&\")\"))","v":"True Mass Correction"},{"$f":"IF(Nx=\"\",\"Conventional Mass Correction\",IF(Rpt_Units=\"Nominal Value\",\"Conventional Mass Correction (\"&Calculations!D58&\")\",\"Conventional Mass Correction (\"&Calculations!D73&\")\"))","v":"Conventional Mass Correction"},{"$f":"IF(Nx=\"\",\"Uncertainty\",IF(Rpt_Units=\"Nominal Value\",\"Uncertainty ± (\"&Calculations!D61&\")\",\"Uncertainty ± (\"&Calculations!D76&\")\"))","v":"Uncertainty"},"k-factor","Degrees of Freedom",{"$f":"IF(Nx=\"\",\"Tolerance\",IF(Rpt_Units=\"Nominal Value\",Class_Spec&\" Tolerance ± (\"&Calculations!D62&\")\",Class_Spec&\" Tolerance ± (\"&Calculations!D77&\")\"))","v":"Tolerance"},"Assumed Density (g/cm³)","Uncertainty of Assumed Density (g/cm³)","Air Density (g/cm³)"]
{"$rows_left_out":2}
{"sheet":"Data Entry","index":7,"n_rows":116,"n_cols":10,"rows_kept":116,"merged":[[0,7,0,9],[3,0,3,5],[3,6,3,8],[4,0,4,5],[4,7,4,9],[5,0,5,5],[5,7,5,9],[6,0,6,5],[6,7,6,9],[9,0,9,1],[9,2,9,9],[10,0,10,1],[10,2,10,4],[10,5,10,7],[10,8,10,9],[11,0,11,1],[11,2,11,4],[11,5,11,7],[11,8,11,9],[12,0,12,1],[12,2,12,4],[12,5,12,7],[12,8,12,9],[13,0,13,1],[13,2,13,4],[13,5,13,7],[13,8,13,9],[14,0,14,1],[14,4,14,5],[15,0,15,2],[15,3,15,4],[15,5,15,7],[15,8,15,9],[16,0,16,1],[16,2,16,4],[16,5,16,7],[16,8,16,9],[17,0,17,1],[17,2,17,5],[17,6,17,7],[17,8,17,9],[18,0,18,7],[18,8,18,9],[19,0,19,4],[19,5,19,6],[19,7,19,8],[20,0,20,4],[20,5,20,6],[20,7,20,8],[21,0,21,3],[21,4,21,5],[22,0,22,4],[22,6,22,8],[23,0,23,1],[23,2,23,3],[23,5,23,7],[24,0,24,7],[24,8,24,9],[27,0,27,9],[28,0,28,1],[28,2,28,3],[28,4,28,5],[28,6,28,7],[28,8,28,9],[29,0,29,1],[29,2,29,3],[29,4,29,5],[29,6,29,7],[29,8,29,9],[30,0,30,1],[30,2,30,3],[30,4,30,5],[30,6,30,7],[30,8,30,9],[31,0,31,1],[31,2,31,3],[31,4,31,5],[31,6,31,7],[31,8,31,9],[32,0,32,1],[32,2,32,3],[32,4,32,5],[32,6,32,7],[32,8,32,9],[33,0,33,1],[33,2,33,3],[33,4,33,5],[33,6,33,7],[33,8,33,9],[34,0,34,1],[34,2,34,3],[34,4,34,5],[34,6,34,7],[34,8,34,9],[37,0,37,9],[38,1,38,2],[39,1,39,2],[40,1,40,2],[41,1,41,2],[42,1,42,2],[43,0,43,9],[44,1,44,2],[44,3,44,4],[44,5,44,6],[45,1,45,2],[45,3,45,4],[45,5,45,6],[46,1,46,2],[46,3,46,4],[46,5,46,6],[47,1,47,2],[47,3,47,4],[47,5,47,6],[48,1,48,2],[48,3,48,4],[48,5,48,6],[49,1,49,2],[49,3,49,4],[49,5,49,6],[50,0,50,9],[51,1,51,2],[51,3,51,4],[51,5,51,6],[52,1,52,2],[52,3,52,4],[52,5,52,6],[53,1,53,2],[53,3,53,4],[53,5,53,6],[54,1,54,2],[54,3,54,4],[54,5,54,6],[55,1,55,2],[55,3,55,4],[55,5,55,6],[56,0,56,9],[57,1,57,2],[57,3,57,4],[57,5,57,6],[58,1,58,2],[58,3,58,4],[58,5,58,6],[59,1,59,2],[59,3,59,4],[59,5,59,6],[60,0,60,9],[61,1,61,2],[61,3,61,4],[61,5,61,6],[62,1,62,2],[62,3,62,4],[62,5,62,6],[63,1,63,2],[63,3,63,4],[63,5,63,6],[64,1,64,2],[64,3,64,4],[64,5,64,6],[65,0,65,9],[66,1,66,2],[66,3,66,4],[66,5,66,6],[67,1,67,2],[67,3,67,4],[67,5,67,6],[68,1,68,2],[68,3,68,4],[68,5,68,6],[69,1,69,2],[69,3,69,4],[69,5,69,6],[70,1,70,2],[70,3,70,4],[70,5,70,6],[73,0,73,2],[73,3,73,4],[73,5,73,6],[73,7,73,8],[74,0,74,2],[74,3,74,4],[74,5,74,6],[74,7,74,8],[75,0,75,2],[75,3,75,4],[75,5,75,6],[75,7,75,8],[76,0,76,2],[76,3,76,4],[76,5,76,6],[76,7,76,8],[78,0,78,9],[79,0,79,9],[80,3,80,4],[80,6,81,9],[81,3,81,4],[82,3,82,4],[82,6,82,9],[85,9,87,9],[86,0,86,1],[87,0,87,2],[87,3,87,5],[87,6,87,7],[88,0,88,2],[88,3,88,5],[88,6,88,8],[88,9,91,9],[89,0,89,2],[89,3,89,5],[89,6,89,8],[90,0,90,2],[90,3,90,5],[90,6,90,8],[91,0,91,2],[91,3,91,5],[91,6,91,8],[92,9,93,9],[93,0,93,2],[93,3,93,5],[93,6,93,7],[94,0,94,2],[94,3,94,5],[94,6,94,8],[94,9,97,9],[95,0,95,2],[95,3,95,5],[95,6,95,8],[96,0,96,2],[96,3,96,5],[96,6,96,8],[97,0,97,2],[97,3,97,5],[97,6,97,8],[98,0,98,1],[99,0,99,9],[101,9,103,9],[102,0,102,1],[103,0,103,2],[103,3,103,5],[103,6,103,7],[104,0,104,2],[104,3,104,5],[104,6,104,8],[104,9,107,9],[105,0,105,2],[105,3,105,5],[105,6,105,8],[106,0,106,2],[106,3,106,5],[106,6,106,8],[107,0,107,2],[107,3,107,5],[107,6,107,8],[108,0,108,1],[110,0,110,2],[110,3,110,5],[110,6,110,7],[111,0,111,2],[111,3,111,5],[111,6,111,8],[111,9,114,9],[112,0,112,2],[112,3,112,5],[112,6,112,8],[113,0,113,2],[113,3,113,5],[113,6,113,8],[114,0,114,2],[114,3,114,5],[114,6,114,8],[115,0,115,1],[116,0,116,9]]}
["Data Entry",{"$nulls":5},"Report Number:"]
[]
["Customer Information"]
[{"$nulls":6},"Customer ID"]
[{"$nulls":6},"PO#"]
[{"$nulls":6},"POC"]
[{"$nulls":6},"Phone"]
[]
{"$rows_left_out":103}
{"sheet":"Control Data","index":8,"n_rows":11,"n_cols":13,"rows_kept":11,"merged":[[1,0,1,12]]}
["Control Chart Information",{"$nulls":11},{"$f":"IF(RptNo=\"\",\"\",\"Report Number: \"&RptNo)","v":""}]
["Note: Copy and Paste Appropriate Row(s) to Control Chart"]
[]
["X-Chart Information"]
[null,"Technician Initials","Date","Report Number",{"$f":"IF(TM_or_CM=\"Conventional Mass\",\"Csc vs 8.0 (\"&BalUnit&\")\",\"Csc (\"&BalUnit&\")\")","v":"Csc ()"},"Balance ID","Start Air Temperature (ºC)","Finish Air Temperature (ºC)","Start Pressure (g/cm³)","Finish Pressure (g/cm³)","Start Humidity\n(% RH)","Finish Humidity\n(% RH)"]
[null,{"$f":"IF(OR(Process=\"\",Process=\"Duplicate Measurements\"),\"\",Tech_Int)","v":""},{"$f":"IF(OR(Process=\"\",Process=\"Duplicate Measurements\"),\"\",Cal_Date)","v":""},{"$f":"IF(OR(Process=\"\",Process=\"Duplicate Measurements\"),\"\",RptNo)","v":""},{"$f":"IF(OR(Process=\"\",Process=\"Duplicate Measurements\"),\"\",IF(AND(TM_or_CM=\"Conventional Mass\",BalUnit=\"g\"),Calculations!F30,IF(AND(TM_or_CM=\"Conventional Mass\",BalUnit=\"mg\"),Calculations!F30*1000,IF(AND(TM_or_CM=\"True Mass\",BalUnit=\"g\"),Calculations!F28,Calculations!F28*1000))))","v":""},{"$f":"IF(OR(Process=\"\",Process=\"Duplicate Measurements\"),\"\",BalID)","v":""},{"$f":"IF(OR(Process=\"\",Process=\"Duplicate Measurements\"),\"\",t_1)","v":""},{"$f":"IF(OR(Process=\"\",Process=\"Duplicate Measurements\"),\"\",t_2)","v":""},{"$f":"IF(OR(Process=\"\",Process=\"Duplicate Measurements\"),\"\",P_1)","v":""},{"$f":"IF(OR(Process=\"\",Process=\"Duplicate Measurements\"),\"\",P_2)","v":""},{"$f":"IF(OR(Process=\"\",Process=\"Duplicate Measurements\"),\"\",hr_1)","v":""},{"$f":"IF(OR(Process=\"\",Process=\"Duplicate Measurements\"),\"\",hr_2)","v":""}]
[]
["R-Chart Information"]
{"$rows_left_out":4}
{"sheet":"Calculations","index":9,"n_rows":81,"n_cols":7,"rows_kept":81,"merged":[[3,0,3,6],[4,0,4,5],[10,0,10,5],[37,0,37,6],[38,4,40,6],[41,4,41,6],[44,0,44,6],[45,4,47,6],[48,4,48,6],[51,0,51,6],[52,0,52,6],[67,0,67,6]]}
["Calculations",{"$nulls":5},{"$f":"IF(RptNo=\"\",\"\",\"Report Number: \"&RptNo)","v":""}]
[]
["Air Density Calculation"]
["Air density results are rounded to 9 digits (g/cm³)"]
["As Found Air Density"]
[null,"tAVERAGE =",{"$f":"IF(t_found=\"\",\"\",t_found)","v":""},"ºC"]
[null,"PAVERAGE =",{"$f":"IF(P_found=\"\",\"\",P_found)","v":""},"mm Hg"]
[null,"hrAVERAGE =",{"$f":"IF(hr_found=\"\",\"\",hr_found)","v":""},"% RH"]
{"$rows_left_out":74}
{"sheet":"Uncertainty Analysis","index":10,"n_rows":146,"n_cols":10,"rows_kept":146,"merged":[[0,2,0,3],[89,0,89,9],[93,1,93,4],[93,5,93,8],[94,1,94,4],[94,5,94,9],[95,1,95,4],[95,5,95,9],[96,1,96,4],[96,5,96,9],[97,1,97,4],[97,5,97,9],[98,1,98,4],[98,5,98,9],[99,1,99,4],[99,5,99,9],[100,1,100,4],[100,5,100,9],[101,1,101,4],[101,5,101,9],[102,1,102,4],[102,5,102,9],[103,1,103,4],[103,5,103,9],[104,1,104,4],[104,5,104,9],[105,1,105,4],[105,5,105,9],[106,1,106,4],[106,5,106,9],[110,0,110,9],[111,0,111,1],[111,3,112,9],[112,0,112,1],[127,0,127,1],[128,0,128,1],[129,0,129,1],[130,0,130,1],[131,0,131,1],[132,0,132,1],[133,0,133,1],[134,0,134,1],[135,0,135,1]]}
["Uncertainty Analysis",{"$nulls":8},{"$f":"IF(RptNo=\"\",\"\",\"Report Number: \"&RptNo)","v":""}]
[]
["Specify Procedure"]
["NISTIR 6969, SOP 4,Weighing by Double Substitution"]
[]
["Specify Equation(s)"]
["Double Substitution Optional Sequence A (SXXS) w/o Air Buoyancy Correction"]
[]
{"$rows_left_out":139}
{"sheet":"CIPM Air Density","index":11,"n_rows":13,"n_cols":5,"rows_kept":13,"merged":[[1,0,1,4],[2,0,2,4],[3,0,3,2],[3,3,3,4],[4,0,4,2],[4,3,4,4],[5,0,5,2],[5,3,5,4],[6,0,6,2],[6,3,6,4],[8,0,8,4],[9,0,9,2],[9,3,9,4],[10,0,10,2],[10,3,10,4],[11,0,11,2],[11,3,11,4],[12,0,12,2],[12,3,12,4]]}
["CIPM Air Density",{"$nulls":3},{"$f":"IF(RptNo=\"\",\"\",\"Report Number: \"&RptNo)","v":""}]
["Air Density, SOP 2, Option B, 2012 (CIPM 2007)"]
["Air Density For As Found Measurement Observations"]
[" Barometric Pressure (mm Hg)",null,null,{"$f":"IF(P_1=\"\",\"\",AVERAGE(P_1+P_corr,P_2+P_corr))","v":""}]
[" Temperature (ºC)",null,null,{"$f":"IF(t_1=\"\",\"\",AVERAGE(t_1+t_corr,t_2+t_corr))","v":""}]
[" Relative Humidity (%)",null,null,{"$f":"IF(hr_1=\"\",\"\",AVERAGE(hr_1+hr_corr,hr_2+hr_corr))","v":""}]
[" Calculated Air Density (mg/cm³)",null,null,{"$f":"IF(D6=\"\",\"\",((((D4*(133.322368421053))*(0.02896546))/((1-(((D4*133.322368421053)/(D5+273.15))*((0.00000158123)+((-0.000000029331)*(D5))+(0.00000000011043*D5^2)+(((0.000005707)+(-0.00000002051*D5))*((D6/100)*((1.00062+0.0000000314*(D4*133.322368421053)+0.00000056*D5^2)*((EXP(0.000012378847*(D5+273.15)^2+(-0.019121316*(D5+273.15))+33.93711047+(-6343.1645/(D5+273.15))))/(D4*133.322368421053)))))+((0.00019898+(-0.000002376*D5))*(((D6/100)*((1.00062+0.0000000314*(D4*133.322368421053)+0.00000056*D5^2)*((EXP(0.000012378847*(D5+273.15)^2+(-0.019121316)*(D5+273.15)+33.93711047+(-6343.1645)/(D5+273.15)))/(D4*133.322368421053))))^2))))+(((D4*133.322368421053)^2/((D5+273.15)^2)*(0.0000000000183+(-0.00000000765*(((D6/100)*((1.00062+0.0000000314*(D4*133.322368421053)+0.00000056*D5^2)*((EXP(0.000012378847*(D5+273.15)^2+(-0.019121316)*(D5+273.15)+33.93711047+(-6343.1645)/(D5+273.15)))/(D4*133.322368421053))))^2))))))*(8.314472)*(D5+273.15)))*(1-((0.378*((D6/100)*((1.00062+0.0000000314*(D4*133.322368421053)+0.00000056*D5^2)*((EXP(0.000012378847*(D5+273.15)^2+(-0.019121316)*(D5+273.15)+33.93711047+(-6343.1645)/(D5+273.15)))/(D4*133.322368421053)))))))))","v":""}]
[]
{"$rows_left_out":6}
{"sheet":"Tables and Lists","index":12,"n_rows":33,"n_cols":23,"rows_kept":33,"merged":[[2,2,2,6],[2,8,2,12],[2,14,2,22]]}
["Tables & Lists",{"$nulls":11},{"$f":"IF(RptNo=\"\",\"\",\"Report Number: \"&RptNo)","v":""},null,"Tables & Lists",{"$nulls":7},{"$f":"IF(RptNo=\"\",\"\",\"Report Number: \"&RptNo)","v":""}]
[]
["Class Specification\nDropdown List\n(Class_Spec_List)",null,"Measurement Option Lookup Table\n(Meas_Option)",{"$nulls":5},"Measurement Option Lookup Table\n(Sc_Meas_Option)",{"$nulls":5},"Conversion Table\n(ConvTable) &\nNominal Value Unit\n(Nom_Val_List)"]
["ASTM E 617, Class 000",null,"Option A (SXXS)","S + ts","X + tx","X + tx + sw","S + ts + sw",null,"Option A (SXXS)","S + ts","Sc + tsc","Sc + tsc + sw","S + ts + sw",null,"Nominal Value (pick from list)","Nominal Value (g)","True Mass As Found","True Mass As Left","CM As Found","CM As Left",{"$f":"IF(ISERROR(Final_k),\"Uncertainty\",\"Uncertainty (k=\"&Final_k&\")\")","v":"Uncertainty (k=)"},"Tolerance","Symbol"]
["ASTM E 617, Class 00",null,"Option B (XSSX)","X + tx","S + ts","S + ts + sw","X + tx + sw",null,"Option B (XSSX)","Sc + tsc","S + ts","S + ts + sw","Sc + tsc + sw",null,"Nominal Value (carat)",{"$f":"IF(Xnom=O5,Nx*0.2,\"\")","v":""},{"$f":"IF(Process=\"Check Standard Measurement\",Calculations!$C$27/0.2,AVERAGE(Calculations!$C$27,Calculations!$F$27)/0.2)","v":{"$error":"#DIV/0!"}},{"$f":"IF(Obs3_1=\"\",\"\",IF(AND(ISNUMBER(Obs3_1),Process=\"Check Standard Measurement\"),Calculations!$C$32/0.2,AVERAGE(Calculations!$C$32,Calculations!$F$32)/0.2))","v":""},{"$f":"IF(Process=\"Check Standard Measurement\",Calculations!$C$29/0.2,AVERAGE(Calculations!$C$29,Calculations!$F$29)/0.2)","v":{"$error":"#DIV/0!"}},{"$f":"IF(Obs3_1=\"\",\"\",IF(AND(ISNUMBER(Obs3_1),Process=\"Check Standard Measurement\"),Calculations!$C$34/0.2,AVERAGE(Calculations!$C$34,Calculations!$F$34)/0.2))","v":""},{"$f":"IF(Final_U=\"\",\"\",Final_U/0.2)","v":""},{"$f":"MPE/1000/0.2","v":0},"carat"]
["ASTM E 617, Class 0",{"$nulls":13},"Nominal Value (grain)",{"$f":"IF(Xnom=O6,Nx*0.06479891,\"\")","v":""},{"$f":"IF(Process=\"Check Standard Measurement\",Calculations!$C$27/0.06479891,AVERAGE(Calculations!$C$27,Calculations!$F$27)/0.06479891)","v":{"$error":"#DIV/0!"}},{"$f":"IF(Obs3_1=\"\",\"\",IF(AND(ISNUMBER(Obs3_1),Process=\"Check Standard Measurement\"),Calculations!$C$32/0.06479891,AVERAGE(Calculations!$C$32,Calculations!$F$32)/0.06479891))","v":""},{"$f":"IF(Process=\"Check Standard Measurement\",Calculations!$C$29/0.06479891,AVERAGE(Calculations!$C$29,Calculations!$F$29)/0.06479891)","v":{"$error":"#DIV/0!"}},{"$f":"IF(Obs3_1=\"\",\"\",IF(AND(ISNUMBER(Obs3_1),Process=\"Check Standard Measurement\"),Calculations!$C$34/0.06479891,AVERAGE(Calculations!$C$34,Calculations!$F$34)/0.06479891))","v":""},{"$f":"IF(Final_U=\"\",\"\",Final_U/0.06479891)","v":""},{"$f":"MPE/1000/0.06479891","v":0},"gr"]
["ASTM E 617, Class 1",{"$nulls":13},"Nominal Value (avdp. ounce)",{"$f":"IF(Xnom=O7,Nx*28.349523125,\"\")","v":""},{"$f":"IF(Process=\"Check Standard Measurement\",Calculations!$C$27/28.349523125,AVERAGE(Calculations!$C$27,Calculations!$F$27)/28.349523125)","v":{"$error":"#DIV/0!"}},{"$f":"IF(Obs3_1=\"\",\"\",IF(AND(ISNUMBER(Obs3_1),Process=\"Check Standard Measurement\"),Calculations!$C$32/28.349523125,AVERAGE(Calculations!$C$32,Calculations!$F$32)/28.349523125))","v":""},{"$f":"IF(Process=\"Check Standard Measurement\",Calculations!$C$29/28.349523125,AVERAGE(Calculations!$C$29,Calculations!$F$29)/28.349523125)","v":{"$error":"#DIV/0!"}},{"$f":"IF(Obs3_1=\"\",\"\",IF(AND(ISNUMBER(Obs3_1),Process=\"Check Standard Measurement\"),Calculations!$C$34/28.349523125,AVERAGE(Calculations!$C$34,Calculations!$F$34)/28.349523125))","v":""},{"$f":"IF(Final_U=\"\",\"\",Final_U/28.349523125)","v":""},{"$f":"MPE/1000/28.349523125","v":0},"oz"]
["ASTM E 617, Class 2",{"$nulls":13},"Nominal Value (apoth. ounce)",{"$f":"IF(Xnom=O8,Nx*31.1034768,\"\")","v":""},{"$f":"IF(Process=\"Check Standard Measurement\",Calculations!$C$27/31.1034768,AVERAGE(Calculations!$C$27,Calculations!$F$27)/31.1034768)","v":{"$error":"#DIV/0!"}},{"$f":"IF(Obs3_1=\"\",\"\",IF(AND(ISNUMBER(Obs3_1),Process=\"Check Standard Measurement\"),Calculations!$C$32/31.1034768,AVERAGE(Calculations!$C$32,Calculations!$F$32)/31.1034768))","v":""},{"$f":"IF(Process=\"Check Standard Measurement\",Calculations!$C$29/31.1034768,AVERAGE(Calculations!$C$29,Calculations!$F$29)/31.1034768)","v":{"$error":"#DIV/0!"}},{"$f":"IF(Obs3_1=\"\",\"\",IF(AND(ISNUMBER(Obs3_1),Process=\"Check Standard Measurement\"),Calculations!$C$34/31.1034768,AVERAGE(Calculations!$C$34,Calculations!$F$34)/31.1034768))","v":""},{"$f":"IF(Final_U=\"\",\"\",Final_U/31.1034768)","v":""},{"$f":"MPE/1000/31.1034768","v":0},"oz ap"]
{"$rows_left_out":25}